program: Gaussian 09
title: 000151144
version: EM64L-G09RevD.01
frameworkgroup: C1[X(C9H12NO5P)]
method: RPBEPBE
basis: SDD
operation: Freq
keyword: #p
keyword: freq=noraman
keyword: PBEPBE/SDD
title: #p freq=noraman PBEPBE/SDD
converged: YES YES NO NO
title: Mulliken charges:
elementType: P O O O O O N C C C C C C C C C H H H H H H H H H H H H
charge: 1.278370 -0.548007 -0.495310 -0.599036 -0.211968 -0.216791 0.021922 0.378665 -0.897651 -0.225884 -0.298486 -0.353252 0.381247 -0.342479 -0.334013 -0.649675 0.293617 0.266014 0.279628 0.204254 0.232363 0.308855 0.262063 0.288917 0.289129 0.210357 0.241488 0.235661
chargesum: 0.00000
title: Mulliken charges with hydrogens summed into heavy atoms:
elementType: P O O O O O N C C C C C C C C C
charge: 1.278370 -0.548007 -0.495310 -0.599036 -0.211968 -0.216791 0.021922 0.378665 -0.058391 0.210734 0.010369 -0.091189 0.381247 -0.053562 -0.044884 0.037830
polarizability: 2.22606150e+02 1.31114940e+01 1.16081441e+02 -1.11218185e+01 1.72966673e+01 1.31022031e+02
1716.lowfreq: -14.7372 -4.9368 -3.4761 -0.0019 -0.0018 -0.0014 16.0397 27.0622 28.8958
frequency: 11.6137 25.8983 28.5556 60.2790 72.4125 93.1407 97.0329 137.4660 147.3500 178.2040 193.2732 217.0609 246.2239 256.8731 276.4937 309.3774 324.6169 353.0661 392.4947 415.8181 439.4226 494.4425 503.0755 551.0771 618.5030 625.2021 665.5472 666.5444 719.6046 733.2467 777.4442 810.5669 835.4335 838.1130 870.3937 879.0596 933.3833 957.6214 982.6074 996.5431 998.9124 1014.4945 1070.3378 1094.5096 1105.3416 1108.8216 1128.8667 1170.2611 1209.5251 1224.2687 1254.8090 1293.8967 1341.8164 1355.1704 1356.9738 1396.1873 1397.6574 1428.8205 1429.4415 1437.4771 1456.5413 1473.7255 1476.8437 1487.2162 1590.3097 1603.4103 2974.3522 2998.3052 3026.1805 3045.2261 3095.4832 3115.1654 3147.5489 3150.3408 3158.0939 3167.7554 3184.7538 3189.2525
redmass: 3.8330 2.5003 3.5525 3.9221 6.8985 6.1212 6.5405 3.8092 1.1114 3.8675 8.0350 3.0387 1.4666 3.4855 6.3230 6.4368 8.5122 6.6297 4.8539 3.0462 8.4145 3.5187 7.0015 7.1831 5.9874 7.0867 6.4112 6.0177 6.4331 4.9504 10.0390 1.0905 6.9436 1.2830 1.6462 3.2472 1.5207 1.3745 1.3302 1.3404 2.9782 2.6083 5.9696 3.1577 2.1968 1.2970 1.4113 1.4893 3.3250 6.0987 1.1541 1.2870 1.1830 1.2550 7.1984 1.2350 10.0045 3.8407 1.0549 1.0490 1.0394 1.9838 1.1534 1.0798 7.8351 6.5498 1.0578 1.0369 1.0318 1.1056 1.0981 1.1020 1.1020 1.1024 1.0924 1.0891 1.0951 1.0971
irintensity: 0.0690 2.1384 0.6439 3.7909 0.0035 2.2028 4.4918 0.5429 0.1307 3.0203 4.1877 1.3028 1.9256 9.4607 2.4027 0.6558 44.1622 27.3285 15.4881 0.2669 56.4990 15.4031 7.6587 8.7766 17.5515 36.1857 111.9451 60.1573 84.4924 6.8329 18.3639 2.5034 272.7593 8.7572 32.8036 157.4123 22.1337 125.9246 0.5572 0.0999 4.8876 116.0095 119.0024 22.8101 28.0449 18.6827 6.9441 277.1514 295.0696 298.6196 0.3559 0.4027 19.6873 10.1050 90.0808 23.6568 29.5582 23.2537 9.2673 15.9966 11.7102 101.7192 21.5087 10.2445 49.0345 189.2625 38.3997 18.6370 0.6097 25.4445 22.6456 30.3715 0.6159 1.8835 3.8035 1.6164 0.9400 3.4472
temp: 298.150 k
press: 1.00000 atm
elementType: 15 8 8 8 8 8 7 6 6 6 6 6 6 6 6 6 1 1 1 1 1 1 1 1 1 1 1 1
symmnumber: 1
zpe: 537680.6 jmol-1
zpe.correction: 0.204792 hartree
zpe.thermalcorrener: 0.222215 hartree
zpe.thermalcorrenthalpy: 0.223159 hartree
zpe.thermalcorrgfe: 0.156066 hartree
zpe.sumelectzpe: -1120.954589 hartree
zpe.sumelectthermal: -1120.937166 hartree
zpe.sumelectthermalent: -1120.936222 hartree
zpe.sumelectthermalfe: -1121.003315 hartree
dipole: -7.7616 1.9887 4.4315
dipole: 9.1562
quadrupole: -119.0138 -99.1670 -102.4019
quadrupole: -7.1933 -7.7473 -3.6407
quadrupole: -12.1529 7.6939 4.4590 -7.1933 -7.7473 -3.6407
hfenergy: -1121.1593811 hartree
pointgroup: C01 [X(C9H12N1O5P1)]
dipole: -3.0425049 -0.0511525 1.9280354 debye
polarizability: 223.9515987|10.9385164|103.4076758|-3.6259512|2.0060595|142.3503473 unknown
InChI: InChI=1S/C9H12NO5P/c1-3-14-16(2,13)15-9-6-4-8(5-7-9)10(11)12/h4-7H,3H2,1-2H3
charge 0 multiplicity 1
28 atoms
P  -2.79008 -0.600995 -0.606315
O  -1.446321 -0.866833 0.531364
O  -3.164248 1.076278 -0.392674
O  -2.506472 -0.931698 -2.130549
O  4.547217 0.305006 -1.390304
O  4.82958 0.114506 0.866456
N  4.092149 0.107607 -0.196529
C  -0.08935 -0.602816 0.271876
C  -4.059007 -1.617246 0.28205
C  -3.251064 1.69348 0.966364
C  0.435758 -0.39172 -1.030156
C  0.750861 -0.591117 1.413943
C  2.644713 -0.139914 -0.034939
C  1.814422 -0.15442 -1.177903
C  2.127561 -0.360218 1.262865
C  -3.466824 3.185769 0.734157
H  -3.776342 -2.677284 0.196457
H  -4.100846 -1.332447 1.34373
H  -5.036201 -1.453957 -0.198196
H  -4.099851 1.243964 1.520153
H  -2.312923 1.493687 1.517107
H  -0.222219 -0.424712 -1.903865
H  0.309476 -0.768763 2.398531
H  2.256361 0.013555 -2.16346
H  2.804187 -0.344975 2.12096
H  -3.544173 3.710549 1.704399
H  -2.622868 3.613984 0.168484
H  -4.394096 3.361529 0.163793
