program: Gaussian 09
title: 000151141
version: EM64L-G09RevD.01
frameworkgroup: C1[X(C22H21ClN2O8)]
method: RPBEPBE
basis: SDD
operation: Freq
keyword: #p
keyword: freq=noraman
keyword: PBEPBE/SDD
title: #p freq=noraman PBEPBE/SDD
converged: YES YES NO NO
title: Mulliken charges:
elementType: Cl O O O O O O O O N N C C C C C C C C C C C C C C C C C C C C C C H H H H H H H H H H H H H H H H H H H H H
charge: -0.045709 -0.222310 -0.206591 -0.459985 -0.450716 -0.469506 -0.459761 -0.189960 -0.189626 -0.233245 -0.007916 -0.141963 -0.106124 -0.160973 0.017500 -0.093980 -0.282844 0.164780 0.146008 0.258551 -0.002745 0.230637 0.309957 -0.638759 -0.320420 -0.338727 -0.239358 -0.142788 -0.373534 -0.377073 -0.239242 -0.246775 -0.240563 0.218842 0.257317 0.252113 0.188761 0.240913 0.247723 0.366870 0.366654 0.380369 0.398209 0.237555 0.234151 0.281911 0.253320 0.300643 0.262438 0.251747 0.317518 0.228275 0.239194 0.229236
chargesum: 0.00000
title: Mulliken charges with hydrogens summed into heavy atoms:
elementType: Cl O O O O O O O O N N C C C C C C C C C C C C C C C C C C C C C C
charge: -0.045709 -0.222310 -0.206591 -0.093114 -0.084062 -0.089137 -0.061552 -0.189960 -0.189626 -0.233245 -0.007916 0.076879 0.151193 0.091140 0.206261 0.146933 -0.035120 0.164780 0.146008 0.258551 -0.002745 0.230637 0.309957 0.114858 -0.067101 -0.038085 0.023080 -0.142788 -0.121787 -0.059555 -0.010967 -0.007581 -0.011327
polarizability: 3.43685360e+02 1.96119200e+00 3.40712609e+02 -3.49291034e+01 1.28188315e+01 2.19289011e+02
1716.lowfreq: -7.6739 -5.2277 -0.0014 -0.0013 -0.0009 1.9755 6.3326 20.6373 32.8874
frequency: 5.4430 20.5681 32.8744 36.4372 44.1087 56.4883 64.8427 70.3253 74.7406 86.8841 96.6229 98.1783 116.2436 130.2248 133.8959 160.2438 172.4760 186.4090 201.8054 212.5203 229.9019 245.7040 259.6138 266.5585 271.8817 284.2118 293.3150 317.1788 326.4842 348.4452 370.7945 377.6556 383.0961 393.6589 401.7669 405.3700 410.7672 415.4150 429.2146 441.7302 455.8233 484.0748 494.0356 508.1056 521.7344 527.5484 535.8381 549.4792 574.9778 587.7179 598.7720 614.1007 620.4158 629.6436 650.8115 671.0710 678.2959 687.0637 693.7006 705.9125 742.6233 781.9772 792.3715 809.4914 819.6086 855.4886 866.0276 901.0459 904.4548 916.6627 921.9737 945.8086 950.9020 957.5232 963.1068 974.9778 982.2209 988.2695 991.7545 998.4923 1015.3495 1021.9719 1027.1160 1036.6582 1048.4963 1069.1756 1073.5199 1086.2539 1089.0778 1089.6459 1090.7682 1102.6536 1113.4132 1114.5396 1134.2514 1171.0735 1172.9881 1179.9200 1190.9256 1216.4656 1219.1712 1222.9295 1230.2650 1255.3461 1258.7587 1267.7444 1272.4775 1285.4684 1288.4468 1296.0224 1303.9988 1311.3808 1320.0394 1323.6747 1345.9861 1356.0733 1371.9415 1381.9739 1382.3544 1385.0225 1395.8788 1406.8384 1425.6058 1433.9281 1458.8162 1465.6772 1481.1966 1496.6204 1540.4084 1566.8230 1586.4937 1593.2139 1608.7069 1643.4526 1689.1607 2876.2762 2909.9452 2912.4288 2949.5127 2988.6046 3004.8987 3013.8911 3083.9003 3125.5310 3127.6402 3136.5626 3149.0368 3157.0486 3159.8500 3170.0003 3170.5455 3177.7843 3513.7480 3525.0027 3553.9402 3558.3101
redmass: 7.2610 9.2402 7.2205 9.6281 6.5245 6.5852 6.0231 6.4391 5.2676 6.4427 4.2011 7.1445 6.0532 2.9535 1.3986 7.8063 6.7701 6.1539 4.6557 5.7198 5.2634 4.9592 5.0917 6.2513 5.3977 5.9123 6.3713 6.7343 6.4476 6.2671 3.9358 1.6352 4.5734 3.6385 5.9763 4.3085 3.7252 3.5097 5.1614 1.2456 5.9496 6.0225 4.2881 3.4735 5.0937 2.4559 1.6039 3.3687 3.7739 3.6701 5.3485 5.4954 2.1177 3.3868 5.6456 5.2099 6.9270 5.7045 4.4815 1.7968 3.2253 3.7615 3.2441 5.7260 1.4865 6.3908 1.2488 2.7939 2.3367 5.9473 3.2200 1.5481 1.3512 5.4069 5.6514 7.2567 6.2424 5.7459 1.3730 5.5871 1.4268 3.8211 2.1105 3.8164 3.4776 2.3508 3.3755 1.8256 2.0472 2.1901 4.0107 1.9045 4.1452 1.4678 1.8740 1.6467 1.1880 1.3116 1.1215 1.2374 1.2756 1.6192 1.2793 1.3927 1.3044 1.5695 1.8222 1.2946 1.9334 1.3372 2.8650 1.5635 1.3622 1.2902 1.3673 1.3961 9.2909 2.3429 3.4905 4.3003 1.4523 1.6490 1.1914 2.3099 1.1750 2.1346 2.3687 1.0628 8.4116 8.2785 6.6022 6.8059 6.1021 10.1352 9.7696 1.0797 1.0803 1.0825 1.0818 1.0385 1.0849 1.0854 1.0951 1.0850 1.1027 1.0890 1.0930 1.0881 1.0966 1.0946 1.0977 1.0973 1.0645 1.0645 1.0655 1.0657
irintensity: 0.9487 0.7191 1.4534 0.7731 2.4598 0.3952 1.3983 1.0544 0.1499 1.0026 1.1625 4.7683 0.0681 2.1444 0.5163 1.5061 5.8083 0.4289 5.9387 0.9090 4.0277 7.0667 10.6360 1.9892 4.2624 1.0523 6.8768 0.9056 0.4545 12.0530 11.0111 71.9697 5.7368 34.1637 7.9786 6.6151 2.8317 24.1604 12.3782 161.6306 1.7482 5.2524 25.4533 5.4627 13.8725 58.4056 112.1802 31.5520 39.1360 45.0206 16.4384 4.8550 73.6254 52.0585 10.3947 26.1713 8.7067 15.4005 10.6781 62.3727 10.5741 0.3172 51.2715 22.9679 36.8399 8.0313 3.0918 57.1073 46.5260 84.5500 21.8078 21.9435 0.6521 115.9904 119.1579 262.4462 103.0583 3.4614 3.0716 91.8632 16.5544 90.4547 2.2248 23.6349 95.3719 8.9661 7.7209 23.2909 80.7167 65.4435 17.2667 93.6726 220.2948 12.2534 2.4290 2.8902 2.7161 22.5839 11.3999 20.5102 4.5533 83.7572 19.4627 0.8645 19.6252 11.8996 57.0439 9.6575 40.4420 79.4264 71.5091 24.0645 21.0165 7.4816 13.6899 25.3166 12.1245 13.1995 4.5407 24.2492 9.0399 24.1356 26.2966 17.6361 63.3264 100.0915 2.7637 14.4808 76.0580 30.9588 6.9998 6.7419 4.0891 371.3267 251.4629 19.3274 12.2602 36.0382 33.4682 42.2728 3.9228 55.3142 17.4923 0.1505 2.4844 11.4808 34.8300 2.9387 9.5217 6.4972 19.4381 4.2196 59.2997 33.4743 22.6319 21.9325
temp: 298.150 k
press: 1.00000 atm
elementType: 17 8 8 8 8 8 8 8 8 7 7 6 6 6 6 6 6 6 6 6 6 6 6 6 6 6 6 6 6 6 6 6 6 1 1 1 1 1 1 1 1 1 1 1 1 1 1 1 1 1 1 1 1 1
symmnumber: 1
zpe: 1052167.2 jmol-1
zpe.correction: 0.400749 hartree
zpe.thermalcorrener: 0.431225 hartree
zpe.thermalcorrenthalpy: 0.432169 hartree
zpe.thermalcorrgfe: 0.336553 hartree
zpe.sumelectzpe: -2019.848519 hartree
zpe.sumelectthermal: -2019.818043 hartree
zpe.sumelectthermalent: -2019.817099 hartree
zpe.sumelectthermalfe: -2019.912715 hartree
dipole: -0.7065 2.5308 2.5021
dipole: 3.6283
quadrupole: -160.8453 -181.4949 -211.6003
quadrupole: 28.8482 13.4765 -4.8134
quadrupole: 23.8016 3.1519 -26.9535 28.8482 13.4765 -4.8134
hfenergy: -2020.2492679 hartree
pointgroup: C01 [X(C22H21Cl1N2O8)]
dipole: 0.2707388 -0.969984 1.0117052 debye
polarizability: 339.9208393|3.1748806|340.5389862|41.054222|-12.9306276|223.2271544 unknown
InChI: InChI=1S/C22H21ClN2O8/c1-25-13-8-7-11(23)9-12(13)14(10-5-3-2-4-6-10)24-19(20(25)29)33-22-17(28)15(26)16(27)18(32-22)21(30)31/h2-9,15-19,22,26-28,30H,1H3
charge 0 multiplicity 1
54 atoms
Cl 5.132919 0.218413 3.628977
O  -2.530264 -0.305332 -0.341509
O  -1.266959 1.599477 -0.878297
O  -5.68709 2.184514 0.837341
O  -2.98748 3.212092 0.818946
O  -5.861615 -0.608825 1.416521
O  -4.937468 -2.848001 0.118481
O  -2.653121 -3.135586 -0.169281
O  0.447638 2.759539 -2.659818
N  2.326138 2.266984 -1.358801
N  0.501439 -0.029572 -0.778923
C  -4.521973 1.306578 0.965999
C  -3.396172 1.972344 0.159351
C  -4.834049 -0.119316 0.494392
C  -2.150174 1.071839 0.101737
C  -3.511729 -0.92477 0.558226
C  0.148866 1.374109 -0.615504
C  -3.599944 -2.389059 0.124426
C  0.940707 2.208205 -1.650024
C  2.932862 1.75247 -0.168307
C  1.653137 -0.466527 -0.307294
C  2.6570 0.435821 0.336827
C  1.910311 -1.935205 -0.411978
C  3.148009 3.088313 -2.282233
C  3.909118 2.553204 0.489192
C  3.344226 -0.011358 1.500434
C  4.585262 2.098094 1.634151
C  4.282259 0.814188 2.132377
C  3.226065 -2.471235 -0.465101
C  0.797291 -2.817003 -0.504126
C  3.424638 -3.862835 -0.599259
C  1.000751 -4.205258 -0.629845
C  2.313769 -4.73459 -0.676638
H  -4.212032 1.246869 2.034187
H  -3.744924 2.158234 -0.876522
H  -5.199399 -0.109538 -0.552816
H  -1.672703 1.001814 1.108198
H  -3.148412 -0.922332 1.614462
H  0.386469 1.752512 0.409163
H  -6.442221 1.743633 1.305935
H  -3.794325 3.784165 0.891122
H  -6.120135 -1.519191 1.114223
H  -4.958507 -3.805761 -0.152715
H  4.172564 2.686089 -2.316836
H  3.173554 4.152223 -1.980533
H  2.686137 3.035845 -3.280102
H  4.127404 3.555056 0.108614
H  3.128454 -1.007228 1.896556
H  5.321911 2.731985 2.13558
H  4.093393 -1.80304 -0.427151
H  -0.214866 -2.400649 -0.483848
H  4.442713 -4.264728 -0.648962
H  0.133419 -4.871335 -0.6915
H  2.469637 -5.814932 -0.775793
