program: Gaussian 09
title: 000151138
version: EM64L-G09RevD.01
frameworkgroup: C1[X(C7H12O3)]
method: RPBEPBE
basis: SDD
operation: Freq
keyword: #pfreq=noraman
keyword: PBEPBE/SDD
title: #p freq=noraman PBEPBE/SDD
converged: YES YES NO NO
title: Mulliken charges:
elementType: O O O C C C C C C C H H H H H H H H H H H H
charge: -0.451007 -0.422557 -0.229035 -0.154812 -0.430392 -0.430402 -0.022797 -0.426842 -0.465937 0.141265 0.250824 0.242333 0.203703 0.203853 0.226749 0.173322 0.221720 0.222475 0.256699 0.184327 0.329597 0.376917
chargesum: 0.00000
title: Mulliken charges with hydrogens summed into heavy atoms:
elementType: O O O C C C C C C C
charge: -0.121410 -0.045640 -0.229035 0.096012 0.015644 0.000199 0.150525 0.017352 -0.024912 0.141265
polarizability: 8.66960735e+01 4.62585067e+00 8.14836345e+01 -1.55346497e+00 1.77114215e+00 7.35704820e+01
1716.lowfreq: 0.0001 0.0006 0.0007 13.8944 20.2144 28.2350 45.9598 80.3297 159.4916
frequency: 34.7442 80.2895 159.4795 198.0462 278.9351 296.1009 321.6570 334.3092 387.1440 425.3724 457.1720 482.6849 536.5169 564.1857 642.3992 688.3833 786.0451 790.3623 823.1307 900.2725 907.7197 942.3529 951.0939 1021.1469 1039.6062 1057.4480 1064.6043 1100.9068 1107.7094 1141.1870 1152.8080 1216.5111 1246.3747 1254.1320 1265.1535 1280.1646 1301.8449 1319.5195 1335.6499 1336.4985 1359.7537 1362.8878 1399.8378 1457.6520 1466.9966 1469.1453 1482.2927 1653.0996 2912.7459 2975.1253 2977.1636 2987.9945 2995.5485 2998.4539 3049.9628 3061.1107 3064.5664 3073.5356 3513.1494 3551.3419
redmass: 8.7515 6.3105 2.7948 3.8845 2.4706 1.3374 2.2065 2.1734 3.8510 3.1530 2.1514 4.1091 3.4290 2.0061 1.6992 3.4575 1.9673 1.8562 3.0268 2.6561 2.1973 1.4087 2.6834 3.3471 2.2536 1.9900 1.5820 1.3284 1.7398 1.3680 1.6536 1.3074 1.2613 1.5870 1.2624 1.5270 1.3596 1.4324 1.5335 1.3903 1.4594 1.6394 1.6836 1.0900 1.0838 1.0876 1.0965 8.5800 1.0835 1.0721 1.0671 1.0661 1.0616 1.0716 1.0967 1.1001 1.0995 1.0984 1.0640 1.0659
irintensity: 1.0063 0.1296 1.8753 5.7355 0.2806 97.2077 61.2085 1.5329 0.9125 3.6007 0.9074 31.9790 7.4358 58.9031 71.7073 32.7353 4.3687 2.0105 12.4968 5.7211 25.1290 7.7813 27.7744 209.7268 90.5294 56.2107 4.1220 3.1523 1.7743 16.8702 3.6563 11.3655 19.4863 5.7663 2.6064 5.8527 9.2204 5.9631 16.1151 3.1364 9.8159 15.8746 2.1666 15.7669 8.3835 15.3797 9.7912 198.2642 61.4811 14.3104 47.5617 27.0211 15.1192 58.7206 29.1177 19.4590 45.0483 28.2707 23.0113 2.6145
temp: 298.150 k
press: 1.00000 atm
elementType: 8 8 8 6 6 6 6 6 6 6 1 1 1 1 1 1 1 1 1 1 1 1
symmnumber: 1
zpe: 484739.0 jmol-1
zpe.correction: 0.184627 hartree
zpe.thermalcorrener: 0.194479 hartree
zpe.thermalcorrenthalpy: 0.195423 hartree
zpe.thermalcorrgfe: 0.149167 hartree
zpe.sumelectzpe: -498.821963 hartree
zpe.sumelectthermal: -498.812112 hartree
zpe.sumelectthermalent: -498.811167 hartree
zpe.sumelectthermalfe: -498.857423 hartree
dipole: 0.3034 -0.0136 2.1776
dipole: 2.1987
quadrupole: -56.9801 -62.8436 -59.8823
quadrupole: 7.8487 -4.7840 -1.8639
quadrupole: 2.9219 -2.9416 0.0198 7.8487 -4.7840 -1.8639
hfenergy: -499.0065902 hartree
pointgroup: C01[X(C7H12O3)]
dipole: 0.1327077 0.0445243 0.8536174 debye
dipolederiv: -0.8112222 0.1374958 -0.2209217 0.153267 -0.3018616 -0.1369847 -0.2674228 -0.1508428 -0.5576276 -0.7853047 -0.4438967 0.0753372 -0.4223817 -0.7984383 0.1933802 0.1491272 0.2581422 -0.3696786 -0.5188399 0.038097 0.1809891 -0.1440002 -0.8443236 -0.1063893 0.1474773 -0.3430771 -0.5286762 -0.0007921 0.0298995 0.0725987 0.1078603 -0.0386673 -0.1021896 0.1496861 -0.0700031 -0.0943309 0.1088284 -0.0499498 -0.0130334 -0.1107342 0.1001152 0.065155 0.0252294 0.0373426 0.1190569 0.0747468 0.0117218 -0.0271181 0.0288048 0.0393678 0.0079536 -0.0062561 -0.0070381 0.1386452 0.6616063 -0.0188836 0.157618 -0.0263626 0.3122699 0.0716667 0.1401699 0.097945 0.4852174 -0.0202291 -0.0341317 -0.0547226 -0.0619013 0.0044794 -0.0035828 -0.0379802 0.0021744 0.0673344 -0.0375677 0.0462129 -0.0870579 0.1186729 -0.0081221 0.0216172 -0.0893696 -0.0205054 0.0065008 0.8812017 0.3577888 -0.4160518 0.4674037 1.2418753 0.1028333 -0.5484753 0.2414972 0.7003903 -0.0813295 -0.0134572 -0.0791562 -0.0335134 0.0755702 -0.0106753 -0.0902592 -0.0105911 -0.0220049 -0.009706 -0.1097022 -0.0153194 -0.0931266 -0.0581533 0.0303081 0.0002824 0.0542128 0.0765636 0.0002266 0.0721532 0.0958437 0.058076 0.0584586 -0.0284138 0.0505205 -0.0661565 -0.1487128 -0.0007682 -0.0235362 0.0986201 -0.01647 0.0734898 -0.0684426 0.058286 -0.0139364 -0.1476245 -0.0115261 0.097541 -0.048886 0.0874521 -0.0999786 0.0445967 -0.0403362 -0.0051646 0.0843699 -0.0564103 0.0157113 0.0603979 0.0162639 -0.0104124 -0.031134 0.0617854 -0.0521611 -0.2378818 -0.0030077 0.114331 -0.0213076 0.098759 -0.1177796 0.0251199 -0.0134647 0.0204215 0.0829175 0.0262909 -0.0100556 0.0774802 -0.0001774 0.066632 -0.0652431 0.0738585 -0.0236173 -0.1056309 0.0752947 0.0449035 0.0509548 0.0229156 0.0629603 -0.0011747 0.0461179 -0.0372346 -0.0839889 -0.0951818 -0.1530955 0.0182151 -0.1200977 -0.1008443 0.0421001 0.0365772 0.0545903 0.0650514 0.2831183 -0.1341726 0.0117285 -0.2024316 0.0804906 0.0702963 0.0386173 0.1171238 0.2650419 0.3205717 0.0250255 0.0837915 0.0717212 0.262872 -0.1207972 0.1158289 -0.083122 0.2050682 unknown
polarizability: 86.5292463|4.6071991|81.7626739|-2.040312|1.2173808|73.4582697 unknown
InChI: InChI=1S/C7H12O3/c8-6-3-1-5(2-4-6)7(9)10/h5-6,8-9H,1-4H2
charge 0 multiplicity 1
22 atoms
O  -3.000846 0.077784 -0.975475
O  2.595488 0.890042 -0.623372
O  1.853331 -1.275768 -0.966178
C  0.905679 0.068959 0.908311
C  0.110287 1.402118 0.759342
C  -0.041903 -1.120877 1.204153
C  -1.969171 0.115338 0.078282
C  -1.032347 1.280443 -0.274327
C  -1.194145 -1.214616 0.173349
C  1.783584 -0.213598 -0.308246
H  1.614315 0.195362 1.753275
H  0.7978 2.218217 0.479085
H  -0.313799 1.654402 1.751861
H  -0.461112 -0.978901 2.220493
H  0.526706 -2.067779 1.210936
H  -2.449114 0.321078 1.064336
H  -1.614301 2.219012 -0.317782
H  -0.625532 1.104335 -1.289475
H  -0.786161 -1.465315 -0.823406
H  -1.880946 -2.035538 0.464907
H  -3.569713 -0.722083 -0.836447
H  3.168298 0.656483 -1.40362
