program: Gaussian 09
title: 000151137
version: EM64L-G09RevD.01
frameworkgroup: C1[X(C3H3ClO3)]
method: RPBEPBE
basis: SDD
operation: Freq
keyword: #p
keyword: freq=noraman
keyword: PBEPBE/SDD
title: #p freq=noraman PBEPBE/SDD
converged: NO NO NO NO
title: Mulliken charges:
elementType: Cl O O O C C C H H H
charge: -0.001355 -0.365373 -0.104098 -0.207288 -0.658671 0.201321 0.139481 0.300827 0.301336 0.393819
chargesum: 0.00000
title: Mulliken charges with hydrogens summed into heavy atoms:
elementType: Cl O O O C C C
charge: -0.001355 0.028447 -0.104098 -0.207288 -0.056508 0.201321 0.139481
polarizability: 6.63438328e+01 2.61936320e+00 5.29100544e+01 -3.15092219e-02 -6.36717480e-03 2.51587977e+01
1716.lowfreq: -22.5683 -9.1540 -0.0023 -0.0013 0.0026 3.9372 33.8135 54.9946 157.7334
frequency: 32.8837 54.9209 157.7308 244.4456 336.4184 358.6530 480.7233 600.4571 605.5503 668.4444 736.1910 770.0871 901.2547 996.1092 1093.0346 1129.2804 1266.7632 1318.8670 1401.8155 1616.6909 1669.3698 3044.6235 3112.3712 3498.8266
redmass: 7.1931 3.4425 10.0626 16.0473 9.6148 3.3068 10.7673 4.5682 1.4288 2.1801 7.2277 6.7967 2.1855 4.0956 2.1842 1.1105 1.3895 2.6519 1.0861 10.7428 11.0280 1.0579 1.1044 1.0645
irintensity: 8.2823 3.2427 1.5357 5.4360 1.4803 1.8606 6.2191 108.8019 76.0134 108.0157 42.4419 0.1985 4.2064 173.6148 65.8279 0.5939 10.8776 12.0745 38.8734 194.5659 77.3280 11.4604 0.3210 47.7170
temp: 298.150 k
press: 1.00000 atm
elementType: 17 8 8 8 6 6 6 1 1 1
symmnumber: 1
zpe: 156085.8 jmol-1
zpe.correction: 0.059450 hartree
zpe.thermalcorrener: 0.066874 hartree
zpe.thermalcorrenthalpy: 0.067818 hartree
zpe.thermalcorrgfe: 0.025688 hartree
zpe.sumelectzpe: -801.293788 hartree
zpe.sumelectthermal: -801.286364 hartree
zpe.sumelectthermalent: -801.285420 hartree
zpe.sumelectthermalfe: -801.327550 hartree
dipole: -2.5313 -1.9244 0.0198
dipole: 3.1798
quadrupole: -41.2513 -54.8851 -44.5480
quadrupole: -2.9943 -0.0125 -0.0121
quadrupole: 5.6435 -7.9903 2.3468 -2.9943 -0.0125 -0.0121
hfenergy: -801.3532381 hartree
pointgroup: C01 [X(C3H3Cl1O3)]
dipole: 1.0309159 0.7086735 0.0083744 debye
dipolederiv: -0.4507971 0.0028961 0.0002509 -0.0868696 -0.1013592 0.0001533 0.0001214 -0.0000418 -0.1293861 -0.8842728 0.5735417 -0.0025316 0.4674674 -0.6597045 0.0010669 -0.0016009 0.000804 -0.3933323 -0.4306953 -0.0589471 0.0004695 0.0738597 -0.6695405 -0.0011642 0.0000112 -0.0044518 -0.244768 -0.653759 -0.1636531 0.000392 0.1942183 -0.8750348 0.0020823 -0.000552 0.0022654 -0.301016 0.4502937 0.2203372 0.0005861 0.4627947 -0.226249 -0.0013297 -0.0018076 0.0006437 0.1435022 0.7587926 -0.0874369 -0.0006907 -0.4254725 0.8329647 0.0041525 -0.000118 0.0049899 0.1869386 0.9977189 -0.2876684 0.0009639 -0.4633755 1.2629806 -0.0054342 0.0027996 -0.0042894 0.2474626 -0.0142994 -0.0414013 -0.0439826 -0.0440036 0.1017015 -0.0522358 -0.0326712 -0.0556924 0.0386918 -0.0146066 -0.0415671 0.0438639 -0.0437135 0.1017526 0.0518747 0.0330377 0.0549581 0.0403005 0.2416249 -0.1161012 0.0006785 -0.1349054 0.2324886 0.0008341 0.0007796 0.0008142 0.4116067 unknown
polarizability: 66.5630885|1.9666888|52.6907207|0.0071771|0.0531176|25.1588757 unknown
InChI: InChI=1S/C3H3ClO3/c4-1-2(5)3(6)7/h6H,1H2
charge 0 multiplicity 1
10 atoms
Cl -3.009881 0.191599 0.002234
O  2.140082 -0.824614 0.002215
O  -0.51044 -1.551395 -0.010867
O  1.496074 1.414463 -0.005716
C  -1.260642 0.803821 0.004197
C  -0.247667 -0.336671 0.001166
C  1.209697 0.194341 -0.00076
H  -1.122569 1.434624 0.897331
H  -1.122267 1.439179 -0.885791
H  3.064412 -0.450247 -0.000308
