program: Gaussian 09
title: 000151131
version: EM64L-G09RevD.01
frameworkgroup: C1[X(C4H7O6P)]
method: RPBEPBE
basis: SDD
operation: Freq
keyword: #pfreq=noraman
keyword: PBEPBE/SDD
title: #p freq=noraman PBEPBE/SDD
converged: YES YES NO NO
title: Mulliken charges:
elementType: P O O O O O O C C C C H H H H H H H
charge: 1.383269 -0.456692 -0.495182 -0.656882 -0.520786 -0.285265 -0.182502 0.334513 0.320172 -0.714279 -0.718289 0.262118 0.254994 0.268649 0.260716 0.251997 0.264441 0.429007
chargesum: 0.00000
title: Mulliken charges with hydrogens summed into heavy atoms:
elementType: P O O O O O O C C C C
charge: 1.383269 -0.456692 -0.495182 -0.227876 -0.520786 -0.285265 -0.182502 0.334513 0.320172 0.071483 0.058865
polarizability: 1.08828764e+02 8.78279071e-01 8.31295776e+01 1.42841571e+00 3.75142493e+00 7.41626950e+01
1716.lowfreq: -5.8958 -0.0004 0.0004 0.0008 6.5955 7.8113 14.9088 47.9943 50.2701
frequency: 9.5361 47.9797 50.2668 67.7897 92.8698 99.8012 108.3217 177.6371 211.5669 222.7810 270.8978 274.7820 312.4560 388.8670 402.8884 531.0394 545.5312 550.4101 586.1719 627.0469 648.5365 653.8301 756.2952 832.5809 851.2521 973.8483 987.6466 1043.3858 1046.4691 1081.9329 1145.7521 1175.6301 1196.3124 1384.3864 1386.2477 1445.1094 1445.7616 1447.5567 1449.6696 1613.7022 1698.4729 3012.6643 3013.0952 3101.8476 3103.2849 3147.4812 3149.5730 3196.0403
redmass: 8.0280 3.1324 4.2970 1.2919 1.5969 1.8851 7.4655 5.7652 7.7827 8.3867 5.7295 6.5357 9.8692 6.5548 5.3985 3.9598 2.7181 3.1377 5.8719 4.6788 1.6325 5.8393 10.4260 9.2226 6.6329 2.2281 1.8579 1.6451 1.6542 7.1972 2.7529 1.4018 3.2160 1.2225 1.2261 1.0574 1.0587 1.0459 1.0532 7.8238 10.6815 1.0364 1.0361 1.0968 1.0971 1.1019 1.1020 1.0670
irintensity: 1.9658 5.2450 1.8852 0.1526 0.0232 0.0698 1.2336 2.3597 9.3297 0.9782 14.3326 6.4669 9.5276 37.3374 103.7547 19.5531 4.6634 25.7030 24.2358 73.8673 77.7298 114.9623 103.7388 519.8293 120.8984 49.5325 38.5027 9.1026 9.8120 150.2762 323.1903 173.1012 309.8224 56.1779 48.1071 28.7075 25.6011 20.8191 29.1803 169.4618 182.0437 0.0569 0.1179 1.9288 2.7562 7.5651 4.3196 313.6796
temp: 298.150 k
press: 1.00000 atm
elementType: 15 8 8 8 8 8 8 6 6 6 6 1 1 1 1 1 1 1
symmnumber: 1
zpe: 308439.2 jmol-1
zpe.correction: 0.117478 hartree
zpe.thermalcorrener: 0.131176 hartree
zpe.thermalcorrenthalpy: 0.132120 hartree
zpe.thermalcorrgfe: 0.074077 hartree
zpe.sumelectzpe: -948.339854 hartree
zpe.sumelectthermal: -948.326156 hartree
zpe.sumelectthermalent: -948.325212 hartree
zpe.sumelectthermalfe: -948.383256 hartree
dipole: -0.3374 3.5191 -3.0152
dipole: 4.6465
quadrupole: -55.6266 -72.7439 -78.4334
quadrupole: -5.8517 -7.6145 -1.8129
quadrupole: 13.3080 -3.8093 -9.4987 -5.8517 -7.6145 -1.8129
hfenergy: -948.4573323 hartree
pointgroup: C01 [X(C4H7O6P1)]
dipole: -0.0432719 1.2340285 -1.3480126 debye
dipolederiv: 2.7276963 0.2186252 0.2540815 -0.3100048 1.7739582 -0.2840822 -0.0013961 -0.3060748 1.6357223 -1.8992696 0.3639373 -0.4253943 0.4892063 -0.7371599 0.1126733 -0.5019448 0.1580824 -0.5696586 -1.6857284 -0.6470247 -0.0366708 -0.7826124 -0.912227 -0.0367999 0.0545076 -0.0375127 -0.5486367 -0.8601872 -0.140474 -0.1738908 -0.0753611 -0.7963232 -0.0087531 -0.2042286 -0.1036465 -0.7555181 -0.7067794 -0.0362788 -0.0258292 0.0328878 -0.5576672 0.0699928 0.034532 0.1137514 -0.5858239 -0.8179827 0.0371652 -0.1619426 -0.3066397 -0.8387439 -0.209949 -0.2020554 -0.0952603 -0.3804572 -0.5223416 0.0109997 0.1614203 -0.3126282 -0.606656 -0.2155076 -0.1628711 -0.3859265 -0.5805154 1.9082683 -0.3128609 0.515964 0.2892856 1.0398968 0.2591916 0.6210418 0.0700516 0.4275496 1.5243949 0.4573155 -0.2639405 1.035881 1.1151661 0.3689314 0.2787792 0.6501481 0.7617457 -0.1421809 0.1400547 -0.0196854 0.1548272 -0.3674173 -0.0221373 -0.0140021 -0.0523361 -0.0043732 -0.3077943 -0.0034838 0.1855942 -0.0164708 -0.0326311 -0.0558306 0.1798118 -0.0450936 -0.1428891 0.0399499 -0.0489582 0.0710356 -0.0476159 0.0857753 0.0432944 0.04305 0.0744137 0.0955303 -0.0439523 0.026009 -0.0728361 0.0089332 0.0704644 -0.0124958 -0.0751939 -0.0021906 0.1048925 0.121904 0.0371118 -0.0225874 0.0087125 0.1242339 -0.0183771 -0.0017968 -0.0314319 -0.023439 0.0906521 0.0133148 -0.0712076 -0.0237409 0.1384633 0.0309899 -0.0498323 0.0203147 -0.0148726 -0.0023884 -0.0797478 0.0084244 -0.10092 0.0251453 -0.038841 -0.0030083 -0.0529201 0.0913394 0.093459 0.0359328 0.0196438 0.0515902 -0.0153783 0.0364403 -0.01729 0.0338854 0.1367242 0.4822803 -0.0716378 0.0578208 -0.09533 0.4911007 -0.0187401 0.0218969 -0.0082541 0.3526799 unknown
polarizability: 108.5938847|0.5959548|83.8713187|3.2921699|2.5983628|73.655833 unknown
InChI: InChI=1S/C4H7O6P/c1-3(5)9-11(7,8)10-4(2)6/h7H,1-2H3
charge 0 multiplicity 1
18 atoms
P  0.048313 -0.908391 0.40638
O  -0.934909 0.59377 0.11644
O  1.519315 -0.498824 -0.439606
O  -0.551913 -2.026992 -0.715434
O  0.149218 -1.301747 1.925458
O  -2.788166 -0.547627 -0.736675
O  2.177451 1.245392 0.993323
C  -2.252712 0.527507 -0.359367
C  2.433843 0.508415 0.033818
C  -2.896914 1.88688 -0.348267
C  3.662953 0.474698 -0.837996
H  -2.270462 2.606978 -0.901264
H  -3.898829 1.827984 -0.796265
H  -2.969116 2.251913 0.691101
H  3.380273 0.595511 -1.897269
H  4.353136 1.274822 -0.534607
H  4.15877 -0.506669 -0.742695
H  -1.540048 -1.873419 -0.885275
