program: Gaussian 09
title: 000013553
version: EM64L-G09RevD.01
frameworkgroup: C1[X(C5H11NO3)]
method: RPBEPBE
basis: SDD
operation: Freq
keyword: #p
keyword: freq=noraman
keyword: PBEPBE/SDD
title: #p freq=noraman PBEPBE/SDD
converged: NO NO NO NO
title: Mulliken charges:
elementType: O O O N C C C C C H H H H H H H H H H H
charge: -0.192282 -0.154289 -0.141523 0.199939 0.234083 -0.298759 -0.705793 -0.693507 -0.693588 0.237250 0.237162 0.214205 0.223796 0.214149 0.205363 0.212288 0.241900 0.205365 0.212320 0.241921
chargesum: 0.00000
title: Mulliken charges with hydrogens summed into heavy atoms:
elementType: O O O N C C C C C
charge: -0.192282 -0.154289 -0.141523 0.199939 0.234083 0.175653 -0.053643 -0.033956 -0.033982
polarizability: 9.95578298e+01 -4.18445485e+00 7.59094663e+01 1.35073699e-02 -1.95270808e-03 5.91757446e+01
1716.lowfreq: -7.8529 -0.0010 -0.0008 0.0002 3.7430 15.5254 45.3986 67.4978 126.1983
frequency: 44.8509 67.4811 126.1927 153.7773 194.7813 233.6646 242.6938 246.7847 291.6637 315.8061 383.7221 399.4010 447.2427 541.7186 617.8838 644.5782 748.4086 763.4200 911.5377 911.6451 922.9324 935.1251 935.1610 947.8822 1027.8272 1047.8299 1158.6694 1171.6399 1223.2290 1265.5777 1282.4839 1336.6889 1371.5915 1376.8614 1403.3523 1454.9156 1456.0027 1465.0601 1470.6634 1480.6186 1482.1052 1497.5649 1504.2599 2971.6573 2976.7019 2980.7030 2995.2147 3064.6222 3066.1286 3072.1090 3074.8991 3078.1969 3089.0496 3093.2903
redmass: 5.7078 4.3468 4.0275 2.1238 1.3494 5.6601 1.0319 1.0469 2.9796 2.0986 2.6010 2.0152 2.5804 6.4316 9.9258 14.0392 4.3061 8.6417 1.8194 2.7585 3.3358 1.4492 1.5231 1.2234 1.5057 1.4128 10.4368 1.2740 2.6394 3.0424 2.1030 1.3706 1.1900 1.2040 1.2085 1.0761 1.0487 1.0539 1.0461 1.0663 1.0568 1.0967 8.9281 1.0349 1.0357 1.0370 1.0549 1.1057 1.1003 1.0992 1.1028 1.0985 1.1002 1.0994
irintensity: 0.0787 0.3387 0.2150 1.6393 0.7085 0.6015 0.0832 0.2517 0.2026 0.2289 0.9217 0.4791 2.0426 2.7580 18.9755 6.1130 42.7360 195.0633 0.2639 42.2878 9.2190 2.3976 2.7785 0.4514 1.9892 0.5975 267.3673 0.1715 8.2511 15.1935 7.0594 7.5976 21.7880 26.0270 10.2840 7.8209 0.0020 2.6383 0.0043 7.6757 15.2627 31.5900 221.9326 26.7806 41.7438 12.5858 14.8961 0.5499 2.2730 10.9877 75.7158 70.5457 2.7106 52.6904
temp: 298.150 k
press: 1.00000 atm
elementType: 8 8 8 7 6 6 6 6 6 1 1 1 1 1 1 1 1 1 1 1
symmnumber: 1
zpe: 424482.1 jmol-1
zpe.correction: 0.161677 hartree
zpe.thermalcorrener: 0.172454 hartree
zpe.thermalcorrenthalpy: 0.173399 hartree
zpe.thermalcorrgfe: 0.125293 hartree
zpe.sumelectzpe: -476.692939 hartree
zpe.sumelectthermal: -476.682161 hartree
zpe.sumelectthermalent: -476.681217 hartree
zpe.sumelectthermalfe: -476.729323 hartree
dipole: -3.6782 0.9785 -0.0006
dipole: 3.8061
quadrupole: -61.5697 -57.5163 -53.0747
quadrupole: 0.3549 -0.0004 -0.0011
quadrupole: -4.1828 -0.1294 4.3122 0.3549 -0.0004 -0.0011
hfenergy: -476.8546157 hartree
pointgroup: C01 [X(C5H11N1O3)]
dipole: 1.4472002 0.3846506 -0.0018282 debye
dipolederiv: -1.3032718 -0.0360426 0.0031887 0.19147 -0.3292601 -0.0017207 0.004988 -0.0007463 -0.2120812 -0.5562406 0.0846822 0.0020477 0.2814815 -0.8010309 -0.0063349 0.003633 -0.0057222 -0.1468817 -0.9530633 -0.2682489 0.0004384 -0.3853053 -0.5920643 -0.0024245 -0.0006482 -0.0027226 -0.1511476 2.2518975 0.0960683 -0.0058325 -0.2027761 1.3739113 0.0104397 -0.0079115 0.0093297 0.1992717 0.1907031 -0.0230464 -0.0004088 -0.1684574 0.1143819 0.0003089 -0.0017089 -0.000231 0.1399449 0.5117704 0.0983598 0.0002263 0.3484747 0.2145309 -0.0016084 0.002052 -0.0007694 0.2835205 -0.1016944 -0.0530832 0.0001251 0.0483391 -0.0062989 -0.0007192 0.0008915 -0.0002896 0.052687 0.0099021 -0.0132363 0.0028475 0.0023549 -0.0136399 -0.0532342 -0.0165809 -0.0629679 -0.0317695 0.0099596 -0.0128083 -0.00341 0.0025129 -0.0156503 0.0535296 0.0164158 0.0634255 -0.0298457 -0.0172171 0.0094729 -0.0365313 -0.0622453 0.00274 0.0723833 -0.0305304 0.097844 -0.0626486 -0.01688 0.0079325 0.0361267 -0.0633729 0.0056751 -0.0707904 0.0290192 -0.0968496 -0.0664193 0.0937267 0.0215293 -0.0476813 -0.0142171 -0.0152412 0.1082229 -0.0096249 0.1454308 -0.0837837 -0.1559059 0.0478464 0.0012281 0.0819355 0.0457296 -0.0007114 0.0015387 -0.0006256 0.1033618 0.0942325 0.0198795 0.0468626 -0.0149993 -0.0112232 -0.1069273 0.0082991 -0.1444004 -0.0882351 0.0968701 0.0247247 -0.0279636 0.0124194 -0.0098894 0.1447126 -0.0171323 0.083097 -0.1116372 -0.1517361 0.1144281 0.0247534 0.0911885 0.0561942 -0.021133 -0.0173593 -0.0008881 0.0776209 0.0256341 -0.1283172 -0.0202326 -0.1254348 -0.0340761 -0.0342922 -0.0078872 0.0009229 0.0828181 0.0972644 0.0234328 0.0262922 0.0107171 -0.0060115 -0.1430397 0.0152978 -0.0815068 -0.1159433 -0.1515522 0.1150917 -0.0207266 0.0913192 0.0555453 0.0200071 0.0209471 -0.0005194 0.0780049 0.0256007 -0.1286653 0.0186499 -0.1254046 -0.0343226 0.0333317 0.0063014 -0.0018108 0.0831631 unknown
polarizability: 99.5595013|4.1794418|75.9064313|-0.0982167|0.1254956|59.1771081 unknown
InChI: InChI=1S/C5H11NO3/c1-5(2,3)4-9-6(7)8/h4H2,1-3H3
charge 0 multiplicity 1
20 atoms
O  -0.755203 -0.474076 0.0011
O  -2.348503 1.287281 0.020596
O  -3.024162 -0.908158 0.004631
N  -2.178455 0.025415 0.009562
C  1.642967 -0.017544 -0.00474
C  0.239663 0.637671 0.006985
C  2.665743 1.151435 0.00125
C  1.826833 -0.87132 -1.286145
C  1.837319 -0.893467 1.260106
H  0.078972 1.265952 -0.888728
H  0.086669 1.249455 0.915358
H  2.551473 1.796249 -0.890291
H  3.694267 0.747194 -0.005162
H  2.557143 1.782064 0.903587
H  1.70782 -0.25466 -2.197054
H  2.839651 -1.313299 -1.305559
H  1.089811 -1.691599 -1.328529
H  1.727611 -0.292468 2.182581
H  2.84958 -1.337221 1.262878
H  1.099502 -1.713401 1.294974
