program: Gaussian 09
title: 000151126
version: EM64L-G09RevD.01
frameworkgroup: C1[X(C13H14N2O)]
method: RPBEPBE
basis: SDD
operation: Freq
keyword: #p
keyword: freq=noraman
keyword: PBEPBE/SDD
title: #p freq=noraman PBEPBE/SDD
converged: YES YES NO NO
title: Mulliken charges:
elementType: O N N C C C C C C C C C C C C C H H H H H H H H H H H H H H
charge: -0.272893 -0.477748 -0.355894 0.208702 -0.199637 0.180780 0.209682 0.188840 -0.379199 -0.673080 -0.565857 -0.228079 -0.344609 0.306203 -0.352747 -0.537519 0.207933 0.295287 0.286826 0.224938 0.210533 0.204623 0.242617 0.245840 0.225629 0.229168 0.245145 0.217607 0.239744 0.217165
chargesum: 0.00000
title: Mulliken charges with hydrogens summed into heavy atoms:
elementType: O N N C C C C C C C C C C C C C
charge: -0.272893 -0.182461 -0.069068 0.208702 0.008296 0.180780 0.209682 0.188840 -0.154260 -0.015307 -0.320018 -0.002450 -0.115441 0.306203 -0.107602 0.136998
polarizability: 2.50586430e+02 -3.80920862e+00 1.64514416e+02 4.28358822e+00 3.11976040e+00 8.09407806e+01
1716.lowfreq: 0.0002 0.0004 0.0006 1.9276 4.1444 9.0225 43.9834 65.9807 88.5599
frequency: 43.8538 65.9752 88.5591 134.3785 148.9604 176.1029 219.1462 229.5222 253.3219 259.1792 292.1396 365.0444 382.5588 397.9289 420.1062 439.1588 443.4824 458.6567 499.8238 530.3876 547.4155 591.2623 607.6591 620.2991 681.8086 691.7417 713.8071 756.6527 791.2390 798.2506 816.0795 840.4627 846.3853 879.5140 894.6411 928.9586 935.0635 994.5915 1006.5387 1040.1989 1066.5237 1100.8562 1113.3474 1120.1894 1151.8776 1165.6409 1194.7865 1216.7045 1229.7216 1256.9849 1262.1542 1302.2673 1317.7786 1330.4238 1371.3081 1381.9304 1415.7478 1433.8662 1455.2189 1457.8552 1463.2848 1464.7518 1470.4646 1477.0923 1485.7593 1500.8486 1572.1064 1590.9804 1629.1231 1637.0269 2901.7847 2948.8172 2970.9828 3031.9418 3064.9290 3094.4621 3116.7127 3132.7437 3152.4071 3158.7688 3170.4821 3187.9497 3572.5752 3609.0402
redmass: 3.1359 3.9117 3.6278 3.9933 4.0215 2.8293 1.1550 1.8578 2.7939 2.0486 2.6234 5.4822 2.4286 2.4401 2.4030 1.8302 2.7479 2.2486 4.8747 3.4994 3.5579 6.0320 4.0968 3.5664 3.2747 2.1371 2.6381 3.4172 4.7419 1.5244 4.7846 2.5371 1.7210 1.2861 4.1301 1.3322 2.7623 5.7070 3.0029 1.5756 2.2716 2.2206 1.2625 1.3371 1.4858 2.0070 2.2625 1.5289 1.6123 1.9139 1.7083 1.8707 1.3463 2.2755 1.2184 2.2837 2.8507 1.4180 1.7751 1.3950 1.0508 1.1561 2.2970 1.1603 2.6622 2.4961 7.0042 6.2851 6.4917 6.4217 1.0842 1.0333 1.0353 1.1034 1.0996 1.1006 1.0987 1.0895 1.0882 1.0908 1.0951 1.0985 1.0771 1.0802
irintensity: 0.4823 5.3875 1.6247 1.7288 8.5890 0.9368 0.4449 0.6184 6.0381 4.5868 11.5889 12.6557 10.8471 26.3749 10.8067 64.8696 7.2373 91.5062 7.3820 5.6339 3.7962 3.6319 6.2520 13.3735 15.2178 31.4780 27.5830 8.4426 21.4822 51.4983 6.7759 10.0185 33.7890 0.9698 8.8158 0.0298 18.1316 42.4816 12.3548 11.2722 23.0772 40.5694 0.2151 3.1043 17.7167 69.2341 91.4104 39.8724 36.5436 17.1932 40.0350 15.3147 31.1076 6.8436 16.6887 12.2468 50.7267 9.6605 68.0359 20.3647 12.2233 10.6032 151.7835 8.9801 5.3665 15.4523 21.2573 34.4303 117.2721 2.5627 85.7716 64.9566 39.5942 56.0874 37.3523 28.7871 33.7896 13.0724 4.2399 8.1772 9.3987 20.9591 23.2403 49.0377
temp: 298.150 k
press: 1.00000 atm
elementType: 8 7 7 6 6 6 6 6 6 6 6 6 6 6 6 6 1 1 1 1 1 1 1 1 1 1 1 1 1 1
symmnumber: 1
zpe: 637496.4 jmol-1
zpe.correction: 0.242810 hartree
zpe.thermalcorrener: 0.257005 hartree
zpe.thermalcorrenthalpy: 0.257950 hartree
zpe.thermalcorrgfe: 0.202137 hartree
zpe.sumelectzpe: -687.343422 hartree
zpe.sumelectthermal: -687.329227 hartree
zpe.sumelectthermalent: -687.328283 hartree
zpe.sumelectthermalfe: -687.384095 hartree
dipole: -3.7546 -0.2693 -0.0303
dipole: 3.7644
quadrupole: -78.6764 -77.9831 -100.7246
quadrupole: 8.7506 2.3967 2.2649
quadrupole: 7.1183 7.8116 -14.9299 8.7506 2.3967 2.2649
hfenergy: -687.586232 hartree
pointgroup: C01[X(C13H14N2O1)]
dipole: 1.4710135 -0.170852 0.0179933 debye
polarizability: 250.7432944|0.0973428|164.1398678|4.3674142|-5.3003046|81.1584648 unknown
InChI: InChI=1S/C13H14N2O/c1-8-13-10(5-6-14-8)11-7-9(16-2)3-4-12(11)15-13/h3-8,14-15H,1-2H3
charge 0 multiplicity 1
30 atoms
O  -4.19639 0.505571 -0.148236
N  0.926838 -1.694118 0.321774
N  3.666477 0.861292 0.45281
C  1.72638 -0.547021 0.230692
C  3.236583 -0.542313 0.217267
C  0.914159 0.582435 0.056989
C  -0.46072 0.114166 0.048494
C  -0.422762 -1.314484 0.217614
C  1.518115 1.905058 -0.027986
C  3.821398 -1.115173 -1.1129
C  -1.713959 0.772888 -0.079447
C  2.874788 1.988032 0.183762
C  -1.600465 -2.091491 0.262326
C  -2.885918 -0.010387 -0.03568
C  -2.832701 -1.428285 0.132909
C  -4.327988 1.950564 -0.31451
H  3.630416 -1.167943 1.050882
H  1.262521 -2.645026 0.455968
H  4.666937 1.002626 0.586405
H  0.928587 2.805201 -0.210849
H  4.927405 -1.072624 -1.101652
H  3.522466 -2.170798 -1.256077
H  3.452083 -0.52837 -1.971563
H  -1.752086 1.858801 -0.204676
H  3.409215 2.942837 0.196315
H  -1.569978 -3.178911 0.392776
H  -3.778454 -1.97755 0.158915
H  -3.902727 2.498064 0.550472
H  -5.410315 2.139365 -0.376043
H  -3.835905 2.298094 -1.245052
