program: Gaussian 09
title: 000151121
version: EM64L-G09RevD.01
frameworkgroup: C1[X(C11H15N5O5)]
method: RPBEPBE
basis: SDD
operation: Freq
keyword: #p
keyword: freq=noraman
keyword: PBEPBE/SDD
title: #p freq=noraman PBEPBE/SDD
converged: YES YES NO NO
title: Mulliken charges:
elementType: O O O O O N N N N N C C C C C C C C C C C H H H H H H H H H H H H H H H
charge: -0.271461 -0.428014 -0.410802 -0.447582 -0.222505 -0.206443 -0.035886 -0.226539 -0.124044 -0.592019 -0.150945 -0.083242 -0.198184 -0.018267 -0.358567 0.258966 -0.211038 -0.114387 0.170615 0.039010 -0.505819 0.205400 0.264231 0.263555 0.228204 0.207362 0.220208 0.381384 0.335908 0.297459 0.348751 0.333504 0.335325 0.238323 0.239652 0.237887
chargesum: 0.00000
title: Mulliken charges with hydrogens summed into heavy atoms:
elementType: O O O O O N N N N N C C C C C C C C C C C
charge: -0.271461 -0.046629 -0.074893 -0.098831 -0.222505 -0.206443 -0.035886 -0.226539 -0.124044 0.076810 0.054454 0.180989 0.065370 0.209937 0.069003 0.258966 0.086421 -0.114387 0.170615 0.039010 0.210042
polarizability: 2.43795691e+02 1.04770878e+01 1.83187217e+02 9.51467588e+00 -4.46909421e+00 1.00708924e+02
1716.lowfreq: -5.7802 -3.0843 -0.0009 -0.0007 -0.0006 9.8891 29.5015 35.2225 55.7926
frequency: 29.4470 35.1440 55.7819 73.8335 87.0491 111.2599 127.1049 136.3727 145.0082 163.1641 181.6883 208.0440 219.8092 230.5185 232.9412 241.8167 261.0551 278.9251 310.6761 324.9130 352.1510 377.2924 384.1971 420.1815 457.4712 481.8461 484.4580 498.2857 527.9652 559.0371 570.9512 596.9637 624.5643 646.8045 654.0256 682.1475 713.4825 763.6718 775.3501 813.4933 821.5984 836.0740 846.7811 904.3017 948.8870 969.5496 987.8787 992.3642 1007.1378 1026.6250 1033.6773 1037.7838 1050.8314 1077.2455 1103.6386 1111.4421 1113.0267 1150.5668 1171.6499 1177.4723 1191.2750 1205.6369 1214.8703 1223.1803 1231.3049 1266.7218 1276.7008 1297.6774 1311.9547 1333.2560 1339.1911 1344.1787 1351.9680 1365.3276 1387.2792 1391.3824 1422.4128 1433.6326 1446.2968 1451.6669 1457.2116 1462.4226 1472.7617 1515.6443 1545.1349 1576.6005 1616.9758 2894.8822 2949.5026 2984.3007 2987.9404 2993.8360 3004.8609 3013.6731 3063.7871 3108.1391 3148.8825 3261.3580 3547.7053 3565.4619 3577.9921 3720.8865
redmass: 5.4972 5.9401 5.7793 5.4969 5.1561 4.8494 2.8855 6.6927 1.2370 2.3433 3.9026 2.8797 1.4501 2.6064 2.3489 5.1022 3.6838 5.0596 5.2658 4.4193 6.5173 6.7424 3.4058 3.3622 1.2204 8.0404 4.0937 1.0572 4.2942 4.8048 5.6270 5.8514 5.0551 7.3317 7.4330 4.7950 11.2635 6.1182 7.4488 4.0968 4.8035 1.3910 1.1567 7.9545 4.9765 5.8226 5.9526 4.2025 5.8407 3.0805 2.8231 3.0544 2.8471 3.5854 3.4951 1.2540 1.9577 1.5546 2.6528 1.9849 1.3872 1.3713 1.1200 2.7720 1.5092 1.4161 2.5862 1.4682 1.3110 2.9711 1.4466 1.6307 1.3133 2.8704 1.3277 4.0489 1.6052 2.5398 1.9401 1.0598 1.0826 1.0588 1.6954 2.3587 8.4341 6.3952 1.5927 1.0822 1.0557 1.0855 1.0722 1.0820 1.0293 1.1052 1.0861 1.1045 1.1049 1.0990 1.0660 1.0446 1.0666 1.1058
irintensity: 1.9073 0.1602 0.2957 0.1327 2.3421 2.5832 8.7676 0.1702 2.2156 48.6556 12.4634 23.4541 94.7339 13.5591 53.5705 2.3031 57.9330 7.6699 4.3709 12.8678 3.0315 1.9812 34.8054 3.2215 271.3778 1.2587 0.5381 22.1087 4.7063 35.0827 14.6801 12.9081 16.2437 6.3497 3.3288 10.9729 1.9229 20.6563 8.0956 8.7706 18.2456 44.1061 108.6250 4.3417 48.6290 180.6283 54.0553 54.8504 115.6796 6.2516 13.4688 24.4570 12.5980 18.2426 76.2688 0.1212 22.4054 7.5378 30.0307 5.1907 6.7597 47.2618 0.4503 216.2450 120.2597 23.4815 2.8889 38.4421 9.7456 25.0114 4.9267 65.7935 55.5084 114.3368 26.6332 34.3255 2.0304 69.0835 31.0337 14.1210 9.8873 55.2812 41.7619 151.8973 342.0515 252.3623 497.2490 48.8356 40.1459 26.4302 717.7426 174.6850 29.8814 52.0430 21.1829 27.3107 18.3054 6.5566 8.6888 128.6768 4.3288 48.3432
temp: 298.150 k
press: 1.00000 atm
elementType: 8 8 8 8 8 7 7 7 7 7 6 6 6 6 6 6 6 6 6 6 6 1 1 1 1 1 1 1 1 1 1 1 1 1 1 1
symmnumber: 1
zpe: 718736.1 jmol-1
zpe.correction: 0.273752 hartree
zpe.thermalcorrener: 0.293815 hartree
zpe.thermalcorrenthalpy: 0.294759 hartree
zpe.thermalcorrgfe: 0.224853 hartree
zpe.sumelectzpe: -1076.434322 hartree
zpe.sumelectthermal: -1076.414260 hartree
zpe.sumelectthermalent: -1076.413315 hartree
zpe.sumelectthermalfe: -1076.483221 hartree
dipole: 1.3474 2.8650 -0.0272
dipole: 3.1661
quadrupole: -89.1705 -134.4779 -118.3625
quadrupole: 21.0894 5.4483 2.5441
quadrupole: 24.8331 -20.4743 -4.3588 21.0894 5.4483 2.5441
hfenergy: -1076.7080743 hartree
pointgroup: C01 [X(C11H15N5O5)]
dipole: -0.514906 1.1291751 -0.1070198 debye
polarizability: 243.0434587|-10.1484531|183.5200738|13.5393315|-3.7042328|101.128299 unknown
InChI: InChI=1S/C11H15N5O5/c1-20-9-5-8(14-11(12)15-9)16(3-13-5)10-7(19)6(18)4(2-17)21-10/h3-4,6-7,10,17-19H,2,12H2,1H3
charge 0 multiplicity 1
36 atoms
O  2.553292 -0.972325 0.778985
O  1.238998 2.415279 0.272499
O  3.962587 1.787616 -1.287988
O  5.264333 -2.149291 0.05007
O  -4.31701 -1.566281 -0.297192
N  0.184403 -0.694699 0.509399
N  -1.376054 -2.358712 0.235556
N  -1.265732 1.295189 0.241634
N  -3.601945 0.678944 -0.17142
N  -2.942426 2.918778 -0.060564
C  1.776502 1.149858 -0.149157
C  1.45292 -0.010373 0.841231
C  3.31696 1.116738 -0.170455
C  3.61448 -0.407358 -0.120498
C  4.989199 -0.754577 0.420274
C  -1.030356 -0.051996 0.292574
C  -0.083679 -2.081782 0.472933
C  -1.989654 -1.094478 0.123136
C  -3.319336 -0.645918 -0.118858
C  -2.585096 1.592698 0.007497
C  -5.682992 -1.047505 -0.539975
H  1.400315 0.853201 -1.159138
H  1.379807 0.39512 1.870394
H  3.705642 1.630441 0.726094
H  3.500771 -0.856566 -1.129365
H  4.995163 -0.610991 1.520701
H  5.725873 -0.066514 -0.04767
H  0.226125 2.276136 0.29618
H  3.501013 1.545952 -2.131711
H  0.711656 -2.808029 0.61266
H  6.119367 -2.437565 0.456325
H  -2.243065 3.645054 0.065421
H  -3.914907 3.152862 -0.237201
H  -6.019481 -0.435201 0.313175
H  -6.295968 -1.953182 -0.648072
H  -5.705702 -0.436323 -1.457569
