program: Gaussian 09
title: 000151117
version: EM64L-G09RevD.01
frameworkgroup: C1[X(C25H25N3O5)]
method: RPBEPBE
basis: SDD
operation: Freq
keyword: #p
keyword: freq=noraman
keyword: PBEPBE/SDD
title: #p freq=noraman PBEPBE/SDD
converged: YES YES NO NO
title: Mulliken charges:
elementType: O O O O O N N N C C C C C C C C C C C C C C C C C C C C C C C C C H H H H H H H H H H H H H H H H H H H H H H H H H
charge: -0.187446 -0.474391 -0.280856 -0.242569 -0.268915 -0.266906 0.024442 0.016197 -0.050776 0.450346 0.420532 -0.477095 0.002643 0.257682 -0.319736 -0.477019 0.003079 -0.392417 -0.466690 0.209498 0.155330 0.298207 -0.068140 -0.703435 -0.366517 -0.386687 -0.323932 -0.257731 -0.235505 0.342083 -0.697540 -0.713810 -0.696099 0.279141 0.280995 0.318134 0.214404 0.241131 0.242843 0.288141 0.233120 0.240277 0.221864 0.371782 0.241103 0.221344 0.273456 0.233870 0.238305 0.224247 0.213200 0.244361 0.230602 0.230175 0.210261 0.243664 0.213140 0.224610
chargesum: 0.00000
title: Mulliken charges with hydrogens summed into heavy atoms:
elementType: O O O O O N N N C C C C C C C C C C C C C C C C C C C C C C C C C
charge: -0.187446 -0.102609 -0.280856 -0.242569 -0.268915 -0.266906 0.024442 0.016197 -0.050776 0.450346 0.420532 0.083041 0.002643 0.257682 -0.319736 -0.158885 0.003079 0.063118 0.064294 0.209498 0.155330 0.298207 -0.068140 -0.008174 -0.125414 -0.165343 -0.050475 -0.023861 0.002800 0.342083 -0.015733 -0.042772 -0.014684
polarizability: 4.79200145e+02 -2.06817280e+01 4.42701418e+02 -2.47376591e+00 -4.78054399e+00 1.71576565e+02
1716.lowfreq: -4.4421 -0.0012 -0.0010 -0.0010 3.6402 5.1564 16.0104 25.4469 31.8861
frequency: 15.9746 25.4224 31.8747 37.7034 53.6262 57.9780 77.3223 87.4491 94.6605 99.0026 118.6328 141.2506 143.2889 147.9706 163.7068 172.3853 174.5742 186.5906 204.8404 222.5056 222.7965 236.1204 238.3732 248.1905 262.1670 273.6204 289.3777 294.2961 317.2038 317.3048 322.4281 329.6173 337.5882 340.4323 366.8258 385.3937 420.7809 423.6942 437.7856 442.9453 457.2764 459.6440 471.3382 514.3993 524.6961 527.2740 547.4331 554.6779 584.3408 593.5910 604.3288 631.9475 638.2180 652.3281 676.8345 696.1511 696.5096 719.8909 741.8264 756.1279 766.2747 772.6636 773.0473 784.3751 798.7913 807.3674 830.0165 879.1776 882.3947 883.5676 896.0131 906.6872 913.1249 919.7828 926.2706 930.3089 950.7991 951.4323 964.8947 965.7642 971.9478 977.6945 986.0757 999.3829 1022.0573 1028.8245 1029.3109 1056.7980 1060.5485 1078.5674 1094.5569 1104.1397 1108.1190 1142.5630 1147.9896 1157.0758 1167.9717 1178.3064 1179.3157 1191.2091 1211.3308 1231.5690 1243.9606 1259.1889 1270.3832 1273.8089 1275.4670 1282.6085 1302.5405 1315.7834 1320.3233 1349.3520 1349.6744 1357.9097 1375.1533 1378.3381 1384.7971 1394.8749 1397.3157 1402.0554 1419.6306 1434.3609 1442.0709 1444.3659 1449.2369 1459.6582 1463.1597 1464.5783 1471.5475 1471.8103 1471.9865 1475.5039 1486.7392 1494.9565 1507.1646 1526.8469 1540.3756 1557.1842 1572.2369 1598.7124 1619.8118 1633.3760 1643.3991 2990.7518 2991.2117 2991.9932 2996.4921 2996.9133 2997.8844 3012.5420 3051.4888 3056.1926 3084.7014 3087.4984 3090.5395 3095.8939 3098.9728 3099.5814 3100.4343 3101.0460 3103.1210 3103.7532 3135.3470 3148.7733 3162.3597 3174.9853 3212.4381 3440.8979
redmass: 2.8401 5.5658 5.3336 4.6945 4.0263 3.5218 4.6167 5.0185 4.0222 3.9832 5.4067 1.2312 3.1305 3.2695 3.3159 4.4450 4.0455 3.5614 2.2677 1.1630 1.4403 2.0898 2.5505 5.2826 2.5809 3.4688 4.0493 4.4720 4.0675 3.0939 3.2690 5.4809 4.7472 3.3776 4.0283 3.4928 3.0330 1.2905 2.9827 3.6957 4.1373 3.9254 5.2351 5.0292 3.9554 4.5009 7.0265 7.5389 5.4923 5.9981 5.8983 6.6333 6.1303 4.6696 5.6913 6.6680 6.2043 4.6912 4.5894 4.7420 4.2528 1.5457 1.4781 5.3492 2.7016 4.7746 4.5647 4.1221 1.8467 1.9809 3.5510 3.4454 1.5839 1.7166 3.3782 1.5030 1.2067 5.2654 3.0745 1.3882 2.0055 2.6893 2.3603 1.3381 1.4261 1.4404 2.1486 2.9092 3.7354 3.6542 2.8137 3.5441 2.3143 1.1086 1.8477 1.4836 2.2380 1.6297 1.5837 1.4148 2.5294 4.7788 2.1378 3.0190 2.7749 2.7313 1.3022 2.2220 1.7271 2.5083 2.0228 2.3095 1.6397 2.4064 1.2399 1.2379 3.1422 1.2132 3.0283 1.3137 4.2888 2.9016 1.3492 1.0482 1.0961 3.1413 1.0502 1.0486 1.0788 1.0696 1.1095 1.0491 1.0500 1.0602 4.0344 6.3589 8.4125 8.7414 10.1936 9.3775 6.4323 10.7828 9.6667 1.0353 1.0373 1.0353 1.0599 1.0362 1.0659 1.0604 1.1013 1.1014 1.0997 1.0998 1.0997 1.1008 1.1001 1.0988 1.0888 1.1001 1.0965 1.0994 1.0854 1.0891 1.0950 1.1000 1.0935 1.0649
irintensity: 0.1074 0.5003 0.7364 0.0744 0.2487 0.0989 0.2820 0.1305 0.9221 1.6875 0.7252 0.0029 0.8064 0.2992 0.3614 11.3041 4.2455 0.8931 2.1016 1.4247 7.7495 8.4179 0.3353 1.4875 3.3178 2.4934 12.3649 6.9652 2.8793 1.6004 1.2019 8.1334 22.5754 1.6383 10.9752 3.1651 4.2503 76.8669 0.5251 24.6576 9.0650 2.0405 12.1565 10.0370 0.9096 11.6948 1.7664 6.1976 0.5296 4.6467 2.1348 32.6019 11.1794 1.5872 7.2755 2.7025 2.7730 8.7186 5.9201 1.1537 2.9071 15.6897 68.6364 6.2035 4.1758 18.9882 58.9233 74.2066 2.5484 52.3547 127.7187 28.5813 0.0342 10.7299 9.8564 21.7931 0.1245 135.2253 92.7965 3.4396 1.3547 44.8225 19.4550 0.1390 0.1493 2.4729 11.8867 10.1081 48.7740 4.2808 66.2932 88.8895 34.1522 0.3468 14.7118 9.3101 5.6119 131.6035 79.3515 13.6448 2.0068 17.8699 27.6623 24.0236 3.2488 25.6491 2.8972 25.9077 8.3357 23.4154 1.1626 14.3652 36.7422 27.9949 36.6614 30.1165 21.4240 16.8329 2.5205 26.1865 10.9191 45.7625 5.6919 0.1261 5.1041 9.0279 0.2418 0.5599 14.9794 7.1849 13.6335 17.3233 9.7648 11.0349 11.5237 57.7499 98.4653 11.2884 327.3554 31.4261 32.9128 364.8740 72.8692 20.8924 40.5359 11.5104 8.0172 23.4605 32.8391 4.6024 6.2666 1.9075 29.2001 5.5938 11.5658 6.4574 21.4424 50.1146 12.1846 30.8997 1.3281 56.1801 0.0774 10.9864 25.0319 28.3648 11.2349 58.9905
temp: 298.150 k
press: 1.00000 atm
elementType: 8 8 8 8 8 7 7 7 6 6 6 6 6 6 6 6 6 6 6 6 6 6 6 6 6 6 6 6 6 6 6 6 6 1 1 1 1 1 1 1 1 1 1 1 1 1 1 1 1 1 1 1 1 1 1 1 1 1
symmnumber: 1
zpe: 1186388.7 jmol-1
zpe.correction: 0.451872 hartree
zpe.thermalcorrener: 0.482381 hartree
zpe.thermalcorrenthalpy: 0.483326 hartree
zpe.thermalcorrgfe: 0.390044 hartree
zpe.sumelectzpe: -1505.660446 hartree
zpe.sumelectthermal: -1505.629936 hartree
zpe.sumelectthermalent: -1505.628992 hartree
zpe.sumelectthermalfe: -1505.722274 hartree
dipole: -7.1645 1.1086 2.7908
dipole: 7.7684
quadrupole: -187.9282 -181.4152 -195.9717
quadrupole: 3.7459 18.2281 -4.1475
quadrupole: 0.5101 7.0232 -7.5333 3.7459 18.2281 -4.1475
hfenergy: -1506.1123179 hartree
pointgroup: C01 [X(C25H25N3O5)]
dipole: -2.8234772 -0.2467503 -1.143749 debye
polarizability: 481.5518969|18.2044897|440.2593893|7.1091438|-2.7663602|171.6668421 unknown
InChI: InChI=1S/C25H25N3O5/c1-5-25(31)18-10-20-21-16(12-28(20)22(29)17(18)13-32-23(25)30)15(11-26-33-24(2,3)4)14-8-6-7-9-19(14)27-21/h6-11,31H,5,12-13H2,1-4H3
charge 0 multiplicity 1
58 atoms
O  5.161217 1.861738 0.98023
O  4.888483 -1.81184 0.615234
O  1.133796 2.954118 0.063201
O  6.380678 0.106927 1.796661
O  -4.99211 1.991469 -0.030244
N  0.571129 0.677579 0.064173
N  -0.507671 -2.757748 0.087225
N  -3.732986 1.303276 0.001237
C  4.702975 -0.458023 0.10844
C  3.220941 -0.092642 0.119395
C  0.89018 -0.680907 0.086307
C  -0.895619 0.927814 0.041188
C  2.896699 1.266562 0.107055
C  -1.459885 -0.472039 0.048951
C  -0.381191 -1.420653 0.074721
C  2.212311 -1.103137 0.117175
C  1.515028 1.735147 0.078184
C  5.263932 -0.381414 -1.355326
C  3.982359 2.307283 0.161797
C  -2.78933 -0.922525 0.034861
C  5.480384 0.518502 1.030296
C  -2.986111 -2.36849 0.049311
C  -1.812942 -3.235129 0.07543
C  6.76666 -0.703696 -1.459325
C  -3.930127 -0.003812 0.006565
C  -4.275185 -2.993092 0.040122
C  -1.979965 -4.656884 0.090619
C  -4.407619 -4.384984 0.055528
C  -3.253224 -5.226721 0.080957
C  -4.801966 3.506551 -0.028069
C  -4.013687 3.915291 -1.285116
C  -6.25962 3.994165 -0.07035
C  -4.087437 3.919609 1.2710
H  -1.175305 1.516285 -0.8512
H  -1.197765 1.536201 0.912697
H  2.469032 -2.161167 0.161443
H  5.049169 0.613818 -1.789227
H  4.679885 -1.119152 -1.937017
H  4.371829 2.578629 -0.838106
H  3.621656 3.223294 0.653821
H  7.389874 0.033026 -0.92124
H  6.978153 -1.703019 -1.042161
H  7.081251 -0.703345 -2.518142
H  5.635789 -1.77494 1.276666
H  -4.9541 -0.399396 -0.010713
H  -5.183516 -2.383404 0.02178
H  -1.070164 -5.263985 0.110956
H  -5.406224 -4.835004 0.048526
H  -3.372685 -6.315134 0.093353
H  -4.525767 3.56569 -2.198691
H  -3.926788 5.01566 -1.332897
H  -2.996174 3.490461 -1.263405
H  -6.819747 3.630271 0.808287
H  -6.766884 3.635072 -0.982425
H  -6.283693 5.098124 -0.067916
H  -3.072658 3.489838 1.31285
H  -3.997669 5.019792 1.317356
H  -4.654695 3.57839 2.154673
