program: Gaussian 09
title: 000151105
version: EM64L-G09RevD.01
frameworkgroup: C1[X(C11H17NO2)]
method: RPBEPBE
basis: SDD
operation: Freq
keyword: #p
keyword: freq=noraman
keyword: PBEPBE/SDD
title: #p freq=noraman PBEPBE/SDD
converged: YES YES NO NO
title: Mulliken charges:
elementType: O O N C C C C C C C C C C C H H H H H H H H H H H H H H H H H
charge: -0.494093 -0.434495 -0.299031 -0.022370 -0.363545 -0.588005 0.569799 -0.674594 -0.713493 -0.558676 -0.422913 0.181566 -0.318749 0.133208 0.177738 0.190646 0.222018 0.189360 0.232153 0.242911 0.203556 0.222939 0.216742 0.203422 0.212943 0.226815 0.225879 0.237470 0.248894 0.370398 0.381507
chargesum: 0.00000
title: Mulliken charges with hydrogens summed into heavy atoms:
elementType: O O N C C C C C C C C C C C
charge: -0.123695 -0.052988 -0.056120 0.155368 0.049119 -0.166492 0.569799 -0.031358 -0.070313 -0.332797 -0.185444 0.181566 -0.069855 0.133208
polarizability: 1.83074325e+02 1.48547699e+00 1.31956887e+02 -1.57769784e+01 3.38022470e+00 9.21966743e+01
1716.lowfreq: -10.1742 -3.4369 -0.0007 -0.0005 -0.0005 10.1825 17.4982 31.6339 48.4040
frequency: 14.7856 31.5608 48.3809 71.2903 116.2343 135.0935 181.7648 204.3403 224.5899 242.1129 263.0198 276.5857 289.6964 296.3624 367.6406 377.1187 430.8730 442.4384 449.4480 472.7927 478.9026 534.5763 570.3505 615.6310 659.2932 710.9652 737.7810 766.0958 798.4265 822.8938 827.1418 843.3293 918.1096 928.2285 940.5076 947.8464 961.6266 1033.1328 1037.5860 1073.1866 1089.4118 1125.4435 1137.3095 1156.6607 1160.0325 1178.2036 1182.3109 1197.8223 1228.4318 1265.8258 1278.5605 1288.1901 1318.3695 1335.4569 1338.9520 1363.7971 1376.5191 1389.5207 1409.8846 1431.4305 1449.3858 1465.3640 1469.6206 1475.7701 1477.9671 1488.6287 1495.6753 1519.8367 1616.0080 1626.0964 2835.1265 2851.3469 2972.2121 2972.8582 2981.2857 3024.2590 3050.9669 3064.9543 3076.9409 3084.0548 3089.8663 3104.9863 3133.6479 3170.1289 3410.6058 3527.7363 3622.8571
redmass: 3.6595 3.0207 4.6342 2.5728 1.8865 4.5023 3.9942 1.1327 4.6417 1.1305 1.1706 4.1050 3.5098 3.0288 3.7869 2.5585 3.0077 3.7346 2.4935 2.2347 1.2299 4.0172 6.3839 3.4407 1.6438 3.9461 3.9944 4.4427 1.2028 1.4321 2.4113 1.5996 1.1774 3.0034 1.3555 1.4143 2.0622 2.7716 1.9424 2.2599 2.6250 1.4429 1.5721 1.5840 1.6566 1.7550 1.4027 1.7252 2.4047 1.3036 1.2415 1.8179 1.3780 1.3721 1.8247 1.3474 1.2954 1.2166 4.0057 3.9764 1.1460 1.0726 1.0829 1.0892 1.0921 1.0636 1.0794 3.2565 6.4951 7.2303 1.0817 1.0716 1.0613 1.0392 1.0354 1.0850 1.0990 1.0981 1.0989 1.1004 1.0997 1.0912 1.0895 1.0954 1.0737 1.0648 1.0666
irintensity: 0.2271 0.2069 0.0470 1.8593 2.5999 0.2399 0.5929 0.2360 3.3396 0.4057 158.6745 10.6716 10.1610 4.2027 0.2784 0.2585 4.4288 13.0997 46.1534 17.0313 93.1110 3.6431 23.5560 43.4449 55.1716 2.7885 6.1054 18.2225 1.2679 28.8895 6.5106 36.2762 4.1091 17.3924 0.3102 0.5004 2.6591 4.1376 2.0578 152.8879 20.9622 18.0041 1.6874 29.8309 11.4831 47.0635 200.5318 19.4346 102.0595 56.9055 2.1954 39.0102 8.0848 39.9387 24.3620 8.8748 17.8160 25.1323 22.9765 42.1283 26.6369 3.6971 3.5289 3.8797 11.0543 4.8925 15.4138 101.8527 19.0925 9.8835 75.4782 120.8112 16.0937 59.3741 18.6461 19.7750 28.0600 40.2492 47.4660 13.9975 67.0934 16.1246 10.9567 6.6605 3.7331 81.3055 45.3681
temp: 298.150 k
press: 1.00000 atm
elementType: 8 8 7 6 6 6 6 6 6 6 6 6 6 6 1 1 1 1 1 1 1 1 1 1 1 1 1 1 1 1 1
symmnumber: 1
zpe: 684575.3 jmol-1
zpe.correction: 0.260741 hartree
zpe.thermalcorrener: 0.276176 hartree
zpe.thermalcorrenthalpy: 0.277121 hartree
zpe.thermalcorrgfe: 0.216468 hartree
zpe.sumelectzpe: -633.467924 hartree
zpe.sumelectthermal: -633.452489 hartree
zpe.sumelectthermalent: -633.451545 hartree
zpe.sumelectthermalfe: -633.512198 hartree
dipole: -1.6335 -3.4747 -0.3652
dipole: 3.8568
quadrupole: -91.4800 -74.8501 -88.3512
quadrupole: -6.6213 0.6727 1.1429
quadrupole: -6.5863 10.0437 -3.4574 -6.6213 0.6727 1.1429
hfenergy: -633.7286652 hartree
pointgroup: C01 [X(C11H17N1O2)]
dipole: -0.6746382 1.3553618 0.101656 debye
polarizability: 183.3759311|0.3230065|132.1306297|14.9143241|2.3480417|91.7213247 unknown
InChI: InChI=1S/C11H17NO2/c1-8(2)12-6-5-9-3-4-10(13)11(14)7-9/h3-4,7-8,12-14H,5-6H2,1-2H3
charge 0 multiplicity 1
31 atoms
O  3.63639 1.944598 0.539234
O  4.666524 -0.55113 0.644513
N  -3.164739 0.186354 -0.431476
C  -4.225351 0.171807 0.61287
C  -1.773173 0.056546 0.049633
C  -0.781014 0.130471 -1.139465
C  0.664569 -0.042773 -0.700514
C  -4.378333 -1.242192 1.215595
C  -5.54934 0.641557 -0.023761
C  1.443685 1.079447 -0.311724
C  1.254681 -1.33019 -0.628919
C  2.765772 0.902656 0.133101
C  2.583612 -1.507765 -0.180482
C  3.347191 -0.390351 0.203842
H  -3.971655 0.875272 1.44878
H  -1.497525 0.835293 0.806557
H  -1.654538 -0.922901 0.548686
H  -0.911791 1.106426 -1.651142
H  -1.066846 -0.653233 -1.864877
H  -3.264255 1.01704 -1.034284
H  -5.186442 -1.254145 1.970073
H  -4.624352 -1.963916 0.415899
H  -3.451473 -1.580648 1.712423
H  -5.459655 1.667979 -0.43015
H  -6.363401 0.6438 0.72262
H  -5.832492 -0.034289 -0.851343
H  1.011122 2.088163 -0.365134
H  0.669942 -2.206315 -0.932013
H  3.04273 -2.499404 -0.128467
H  3.204698 2.82958 0.478175
H  5.038058 0.343562 0.864449
