program: Gaussian 09
title: 000151102
version: EM64L-G09RevD.01
frameworkgroup: C1[X(C18H20O2)]
method: RPBEPBE
basis: SDD
operation: Freq
keyword: #pfreq=noraman
keyword: PBEPBE/SDD
title: #p freq=noraman PBEPBE/SDD
converged: YES YES NO NO
title: Mulliken charges:
elementType: O O C C C C C C C C C C C C C C C C C C H H H H H H H H H H H H H H H H H H H H
charge: -0.414084 -0.237859 0.011650 -0.419003 -0.583004 -0.523877 -0.735621 0.511929 -0.452094 -0.409185 0.172484 0.342736 -0.396470 -0.406501 0.341496 -0.400022 -0.398853 -0.236302 -0.236637 -0.243733 0.221557 0.242366 0.204683 0.212370 0.209632 0.251349 0.252640 0.213443 0.227204 0.207694 0.230573 0.239194 0.235057 0.236271 0.237794 0.238490 0.375905 0.224177 0.224191 0.228360
chargesum: 0.00000
title: Mulliken charges with hydrogens summed into heavy atoms:
elementType: O O C C C C C C C C C C C C C C C C C C
charge: -0.038179 -0.237859 0.233207 0.028046 -0.161002 -0.019888 -0.087280 0.511929 -0.221520 -0.169991 0.172484 0.342736 -0.161413 -0.170230 0.341496 -0.162228 -0.160363 -0.012126 -0.012446 -0.015373
polarizability: 3.02579910e+02 2.10933855e+01 1.95133088e+02 -1.24267240e+01 9.88657254e+00 1.22752185e+02
1716.lowfreq: -2.6700 -0.0010 -0.0009 -0.0004 5.8200 8.7963 19.6276 23.4132 26.8334
frequency: 19.3381 23.1459 26.7094 34.7515 60.8417 71.8897 92.8519 103.7319 123.5268 163.4324 187.4463 205.4902 234.4425 272.9413 318.2222 332.6168 334.4344 358.7882 404.5722 409.9464 417.7010 440.3910 481.8076 503.3665 510.9980 558.8030 586.2808 602.5779 614.7890 639.4774 648.3438 702.2939 709.7408 737.5293 765.7410 774.4149 812.5631 831.1872 847.4195 849.3188 850.5444 867.7779 898.6587 918.6842 939.9624 959.3830 966.7039 972.5736 973.0581 988.5364 992.1802 996.4146 1017.3925 1032.1703 1040.5392 1041.3999 1079.6914 1085.1109 1096.6417 1131.1417 1156.1231 1168.1621 1172.7748 1190.1347 1201.7361 1216.0995 1224.6409 1244.1191 1270.4437 1281.7784 1289.8695 1304.9922 1307.4028 1319.3129 1333.3860 1346.4478 1363.9010 1367.2249 1374.3146 1392.1192 1412.6372 1431.4329 1438.5330 1460.1036 1476.8439 1479.0231 1481.8607 1486.5874 1517.4920 1567.8328 1588.5158 1613.0267 1622.8183 1664.4739 2967.5435 2973.5181 2978.4607 2984.3216 2987.9799 3024.9640 3043.5998 3051.4263 3064.1617 3080.7535 3114.7306 3116.5377 3121.1598 3126.1432 3139.1623 3139.9875 3146.5886 3147.8750 3163.7605 3507.8620
redmass: 4.3631 4.9663 5.9893 7.5888 4.6649 3.7664 4.1406 2.4709 3.2042 2.8270 3.4903 3.7851 1.2371 3.6149 3.5756 3.6994 3.3476 3.5182 2.8511 2.8557 2.4651 3.2722 3.4777 2.6886 2.3316 2.7800 4.3471 4.5006 6.3840 6.6794 1.3819 1.7368 4.7717 3.0594 1.5275 1.5871 3.8219 1.8821 2.0885 1.4724 1.2909 2.1558 2.0145 1.4510 1.3667 1.3883 1.8413 1.3925 1.4530 4.9238 1.3128 6.6368 2.8717 3.2567 2.0688 2.0107 1.5931 1.5792 2.3993 1.4297 1.8774 1.3590 1.0525 1.1107 1.1385 1.3788 2.3788 1.4761 1.2820 1.2393 2.9974 1.4633 1.5837 1.3053 1.3329 1.5667 1.8819 2.2996 8.5773 1.2194 3.5071 1.0875 2.3874 1.0827 2.0670 1.0905 1.0944 1.0537 2.8809 5.8587 6.4779 6.0346 6.3786 8.1620 1.0627 1.0383 1.0643 1.0633 1.0747 1.0978 1.0969 1.1027 1.0990 1.0977 1.0874 1.0874 1.0843 1.0874 1.0922 1.0950 1.0960 1.0962 1.1016 1.0639
irintensity: 0.0445 0.2977 0.6622 0.9731 0.4207 0.0177 0.3560 0.4329 0.1176 1.2913 0.2211 0.5651 0.6583 0.2314 0.7796 4.4960 1.7415 1.3778 0.3327 0.1195 0.9631 3.9361 21.9506 18.4754 19.1685 1.8232 23.7469 7.6108 0.0734 0.6559 135.7270 47.5648 2.9444 19.0052 45.1354 26.0102 5.1534 11.6762 5.3365 0.6994 0.4686 26.4990 22.5562 2.0538 4.8440 1.3945 24.8581 1.3962 0.0782 0.5376 0.0943 9.6543 0.3678 16.3415 181.4309 62.5893 11.5158 12.7582 9.5030 17.3778 20.6776 1.1066 0.0369 0.9929 0.4200 12.3406 0.7693 3.3404 13.2612 5.8195 0.2576 2.1892 14.1502 1.1501 2.0440 11.9138 35.5175 11.5792 0.0783 13.5627 4.1301 32.0649 3.8971 2.7362 58.6905 10.4629 0.9643 19.3142 11.3629 1.2907 1.4076 14.6564 1.8791 192.8025 2.1672 28.2635 31.0369 26.7299 34.2607 0.2037 7.3410 41.2621 59.9040 44.2305 5.6587 38.0255 2.7057 2.0954 16.2663 20.1247 1.2475 50.2665 26.6382 20.2623
temp: 298.150 k
press: 1.00000 atm
elementType: 8 8 6 6 6 6 6 6 6 6 6 6 6 6 6 6 6 6 6 6 1 1 1 1 1 1 1 1 1 1 1 1 1 1 1 1 1 1 1 1
symmnumber: 1
zpe: 869141.6 jmol-1
zpe.correction: 0.331039 hartree
zpe.thermalcorrener: 0.350076 hartree
zpe.thermalcorrenthalpy: 0.351020 hartree
zpe.thermalcorrgfe: 0.280200 hartree
zpe.sumelectzpe: -846.931707 hartree
zpe.sumelectthermal: -846.912670 hartree
zpe.sumelectthermalent: -846.911725 hartree
zpe.sumelectthermalfe: -846.982545 hartree
dipole: -1.2441 -0.4617 -1.1474
dipole: 1.7543
quadrupole: -104.2998 -105.9944 -126.6519
quadrupole: 1.7426 1.2139 1.0884
quadrupole: 8.0156 6.3210 -14.3366 1.7426 1.2139 1.0884
hfenergy: -847.2627453 hartree
pointgroup: C01 [X(C18H20O2)]
dipole: 0.4860773 -0.1218908 0.4745804 debye
polarizability: 302.7633979|-22.2449486|191.393162|-8.2902966|-18.918256|126.3086222 unknown
InChI: InChI=1S/C18H20O2/c1-14(13-18(19)20)7-8-15-9-11-17(12-10-15)16-5-3-2-4-6-16/h2-6,9-12,14,19H,7-8,13H2,1H3
charge 0 multiplicity 1
40 atoms
O  5.773433 2.615718 0.660332
O  4.743175 1.728452 -1.218421
C  4.409686 -0.874718 0.118867
C  2.9012 -0.563184 0.311905
C  1.960788 -1.499353 -0.497522
C  5.281767 0.257959 0.711405
C  4.814932 -2.228556 0.747949
C  0.498605 -1.095658 -0.380173
C  -0.402011 -1.80679 0.452259
C  -0.001611 0.031574 -1.083788
C  5.20721 1.556722 -0.069378
C  -2.252026 -0.281375 -0.124482
C  -1.749551 -1.409107 0.579851
C  -1.347191 0.430285 -0.960735
C  -3.677961 0.137316 0.002686
C  -4.70908 -0.824066 0.195303
C  -4.048757 1.509305 -0.066861
C  -6.05881 -0.430233 0.315193
C  -5.398322 1.905004 0.049704
C  -6.411865 0.937432 0.242211
H  4.608176 -0.913709 -0.97191
H  2.70219 0.477796 -0.006655
H  2.642887 -0.625983 1.389413
H  2.085684 -2.543642 -0.154495
H  2.277132 -1.467177 -1.559518
H  5.011843 0.466275 1.764316
H  6.349289 -0.043373 0.727973
H  5.884685 -2.448455 0.571818
H  4.230729 -3.062854 0.321599
H  4.645722 -2.223027 1.842276
H  -0.041329 -2.679134 1.01169
H  0.668995 0.591372 -1.7480
H  -2.412234 -1.963419 1.254473
H  -1.711421 1.282246 -1.546344
H  -4.4543 -1.889748 0.21951
H  -3.271226 2.272959 -0.183053
H  5.736803 3.445547 0.110408
H  -6.836041 -1.19032 0.454278
H  -5.658394 2.968552 0.000496
H  -7.459699 1.244368 0.333419
