program: Gaussian 09
title: 000151100
version: EM64L-G09RevD.01
frameworkgroup: C1[X(C20H30O2)]
method: RPBEPBE
basis: SDD
operation: Freq
keyword: #pfreq=noraman
keyword: PBEPBE/SDD
title: #p freq=noraman PBEPBE/SDD
converged: YES YES NO NO
title: Mulliken charges:
elementType: O O C C C C C C C C C C C C C C C C C C C C H H H H H H H H H H H H H H H H H H H H H H H H H H H H H H
charge: -0.180706 -0.438012 -0.123900 -0.102300 0.201051 -0.156822 0.313863 -0.078323 -0.525592 -0.513731 -0.520338 -0.487789 -0.540867 0.544569 -0.531224 0.041442 -0.510664 -0.862023 -0.798151 -0.077898 -0.636696 -0.792208 0.207791 0.235922 0.217426 0.205948 0.209253 0.233046 0.214128 0.212240 0.213531 0.224931 0.196605 0.215786 0.233433 0.215789 0.232215 0.191865 0.246804 0.246268 0.222810 0.225598 0.227442 0.241727 0.235401 0.226518 0.205286 0.230790 0.227087 0.229276 0.220670 0.330734
chargesum: 0.00000
title: Mulliken charges with hydrogens summed into heavy atoms:
elementType: O O C C C C C C C C C C C C C C C C C C C C
charge: -0.180706 -0.107278 0.083891 0.133623 0.201051 0.060604 0.313863 0.127625 -0.083293 -0.087364 -0.081876 -0.075398 -0.091645 0.544569 -0.107143 0.041442 -0.017592 -0.186174 -0.094505 0.127388 -0.178819 -0.342262
polarizability: 2.30529543e+02 -7.52220339e+00 2.10027404e+02 3.25655035e+00 -3.60679048e+00 1.80997867e+02
1716.lowfreq: -20.0270 -13.1848 -4.3414 -0.0009 -0.0005 0.0004 38.4494 52.0641 72.0980
frequency: 38.3990 52.0297 72.0388 98.5876 114.8363 127.9213 154.1843 174.5090 182.3811 200.2036 227.5380 242.9146 261.6320 271.8682 277.5541 280.3977 296.8135 298.5666 311.1796 331.4852 357.2240 363.9731 388.8907 398.0967 401.0223 431.9237 443.3381 460.2099 475.0427 503.1906 516.7650 535.5535 557.1344 563.3349 567.1115 593.4482 612.8794 636.4735 694.9408 705.3016 743.4491 794.0344 818.2776 823.2008 829.2864 842.3612 875.3127 888.1865 892.9692 910.9487 915.4989 932.0737 936.7140 946.1014 953.5088 972.4870 984.0950 992.7666 993.8032 1003.1634 1012.2355 1019.4279 1040.2102 1046.7876 1060.0792 1074.4678 1080.6961 1084.3817 1098.2783 1107.0771 1112.1866 1122.5105 1136.0303 1150.8857 1163.5944 1171.3454 1173.4391 1195.4178 1202.5094 1210.6883 1226.0950 1238.2012 1240.4705 1247.4192 1255.3508 1261.9459 1270.6615 1280.0740 1287.1156 1288.6882 1292.2937 1300.5385 1314.7448 1320.0110 1327.2265 1328.7682 1332.6374 1338.6055 1345.6128 1349.5932 1352.8089 1368.0564 1380.5802 1387.4319 1389.3960 1427.7263 1428.2912 1460.1587 1461.4462 1468.3355 1470.0319 1472.0026 1473.2360 1473.7289 1481.8382 1488.2743 1490.5370 1500.7351 1648.8811 1653.7667 2902.4183 2939.5431 2940.8274 2948.0456 2958.6327 2966.0974 2975.0170 2977.1991 2981.4360 2983.7644 2985.3249 2989.1540 2994.1063 2996.9854 3002.7646 3017.1680 3032.9254 3037.2409 3038.2479 3047.4820 3056.5879 3065.2957 3071.0930 3079.0982 3079.4303 3090.8981 3096.2870 3097.1460 3196.8259 3551.9796
redmass: 5.0235 3.9073 4.8217 3.2945 3.1175 2.7252 2.6860 2.0890 2.4764 2.8948 1.5914 1.7657 1.9986 2.2764 2.3983 1.8866 2.6014 1.5980 2.3000 2.8381 2.6625 2.3457 2.9148 3.4514 3.3977 3.2720 3.0015 2.3975 2.7947 2.3757 2.3795 2.3060 2.5476 3.1486 3.8217 3.6195 3.5208 3.0269 2.3832 1.2728 2.4921 2.3878 1.8118 1.8746 2.0926 2.0955 1.9973 1.8743 2.3579 2.4552 1.8482 1.6436 1.5081 1.7650 1.9383 1.8783 2.1046 1.8798 3.1135 2.0063 2.1524 1.8038 1.9983 2.2551 1.9650 2.6742 2.0436 1.7959 1.7053 1.9102 1.4537 2.0313 2.2392 1.9610 2.4835 1.6925 2.2643 1.3905 1.6052 1.5785 1.8521 1.6018 1.6138 1.3907 1.6518 1.4725 1.3091 1.9188 1.3676 1.4545 1.2902 1.3537 1.4183 1.4312 1.3397 1.4348 1.4014 1.4295 1.4470 1.4160 1.4515 1.4272 1.1884 1.5940 1.2222 1.1728 1.0807 1.0743 1.0895 1.0790 1.0860 1.0773 1.0898 1.0866 1.0567 1.0748 1.0626 1.0595 5.0835 12.0553 1.0805 1.0836 1.0797 1.0813 1.0635 1.0636 1.0777 1.0631 1.0653 1.0612 1.0568 1.0433 1.0406 1.0599 1.0666 1.0972 1.1006 1.0968 1.0968 1.1019 1.0979 1.0973 1.1018 1.0972 1.0989 1.0986 1.0914 1.0682 1.1118 1.0660
irintensity: 0.1051 0.5830 4.4265 0.9065 0.2794 0.4543 2.3841 0.4840 1.0670 0.6635 1.5273 0.9435 7.6463 1.3752 6.7592 21.9091 0.5848 78.9061 41.5666 0.0853 0.8320 0.5875 0.3464 9.8437 0.8676 0.8948 2.8968 0.6811 2.3406 0.9611 3.9358 0.0077 6.7728 1.5481 5.5989 8.2079 1.0304 3.0745 3.2263 1.1305 1.4467 0.5952 8.6519 2.7343 5.9360 4.1222 0.7064 16.4150 3.9681 12.5742 2.7200 33.6440 30.4003 2.6210 23.8409 4.8834 18.9402 6.6769 49.9453 32.5550 5.5275 19.1881 3.3046 24.4907 5.0409 10.7006 4.3133 12.3038 9.0097 6.7159 1.9677 1.0737 3.7416 10.8355 3.9813 3.4587 11.5763 2.0357 12.2604 9.2112 16.2584 5.7862 1.0174 6.0910 3.3327 5.7865 2.7913 2.3918 14.4325 6.1960 1.1640 4.5243 1.0043 0.4078 1.3457 0.8620 0.5135 1.5376 5.0932 1.9233 23.8518 2.3985 24.2086 5.2027 22.7846 14.5177 16.0820 3.7369 8.4348 11.4138 21.3845 3.6586 9.3295 5.6453 2.1517 10.9915 5.2345 6.4653 29.5592 189.5194 14.9569 27.2683 7.9532 33.7395 16.4959 32.1380 11.3278 36.3072 72.8163 12.0337 16.8380 28.2894 37.8161 26.1753 12.1477 44.3215 63.3638 19.1818 63.7625 46.9131 11.7935 33.9384 39.6434 42.0814 18.0134 25.9647 16.6992 26.7852 18.3405 2.7021
temp: 298.150 k
press: 1.00000 atm
elementType: 8 8 6 6 6 6 6 6 6 6 6 6 6 6 6 6 6 6 6 6 6 6 1 1 1 1 1 1 1 1 1 1 1 1 1 1 1 1 1 1 1 1 1 1 1 1 1 1 1 1 1 1
symmnumber: 1
zpe: 1200773.9 jmol-1
zpe.correction: 0.457351 hartree
zpe.thermalcorrener: 0.478144 hartree
zpe.thermalcorrenthalpy: 0.479088 hartree
zpe.thermalcorrgfe: 0.410370 hartree
zpe.sumelectzpe: -928.848319 hartree
zpe.sumelectthermal: -928.827526 hartree
zpe.sumelectthermalent: -928.826581 hartree
zpe.sumelectthermalfe: -928.895300 hartree
dipole: 2.1811 3.3263 3.3015
dipole: 5.1693
quadrupole: -147.6861 -130.9332 -142.0960
quadrupole: -3.5089 -6.1591 -5.8939
quadrupole: -7.4477 9.3053 -1.8576 -3.5089 -6.1591 -5.8939
hfenergy: -929.3056699 hartree
pointgroup: C01 [X(C20H30O2)]
dipole: -0.8647025 -1.347991 1.2535344 debye
polarizability: 230.6093092|-7.4134378|209.7602852|-3.1171415|4.3896441|181.1852209 unknown
InChI: InChI=1S/C20H30O2/c1-12-10-14(21)11-13-4-5-15-16-6-7-18(22)19(16,2)9-8-17(15)20(12,13)3/h13-17,21H,1,4-11H2,2-3H3
charge 0 multiplicity 1
52 atoms
O  4.695711 1.078337 -1.51339
O  -4.10642 -0.718399 -2.596798
C  -0.281931 0.315426 0.13421
C  0.67019 -0.788604 0.712611
C  -1.673093 0.367943 0.893502
C  1.963661 -0.778188 -0.12623
C  2.687878 0.602096 -0.104838
C  -2.337938 -1.070727 0.838389
C  0.408168 1.70731 0.033423
C  -0.013481 -2.17773 0.695676
C  1.763105 1.670414 -0.724462
C  -1.389527 -2.164724 1.39978
C  3.096278 -1.80571 0.143741
C  -2.625403 1.359823 0.185234
C  -2.834624 -1.462609 -0.581762
C  3.984578 0.271353 -0.868088
C  4.276782 -1.238513 -0.697402
C  -1.476026 0.765887 2.379578
C  3.166537 1.039768 1.317672
C  -3.76696 -0.404673 -1.193783
C  -3.078364 0.969481 -1.217068
C  -3.099422 2.503589 0.748374
H  -0.493996 -0.000893 -0.910928
H  0.925645 -0.542751 1.764207
H  1.647885 -0.939987 -1.184916
H  -3.234765 -1.022742 1.494412
H  0.56724 2.124504 1.04656
H  -0.274688 2.411592 -0.477485
H  0.643571 -2.924193 1.1831
H  -0.129961 -2.507461 -0.357763
H  1.586901 1.42318 -1.790929
H  2.242399 2.667041 -0.703232
H  -1.87598 -3.154949 1.290183
H  -1.24274 -2.01272 2.486409
H  2.822638 -2.82979 -0.162872
H  3.3544 -1.841915 1.21898
H  -1.98802 -1.607159 -1.278829
H  -3.36126 -2.437594 -0.511799
H  4.310621 -1.691597 -1.707587
H  5.276943 -1.390963 -0.253288
H  -1.049891 1.779034 2.478699
H  -2.44426 0.755353 2.913195
H  -0.798574 0.073609 2.904853
H  3.744162 1.977668 1.233194
H  2.313401 1.221921 1.992094
H  3.815968 0.284577 1.795615
H  -4.697818 -0.338031 -0.586897
H  -3.773137 1.722917 -1.626477
H  -2.223478 0.898346 -1.918946
H  -2.828359 2.832951 1.75593
H  -3.788155 3.154666 0.196471
H  -4.55859 -1.599967 -2.62602
