program: Gaussian 09
title: 000151099
version: EM64L-G09RevD.01
frameworkgroup: C1[X(C18H24O3)]
method: RPBEPBE
basis: SDD
operation: Freq
keyword: #pfreq=noraman
keyword: PBEPBE/SDD
title: #p freq=noraman PBEPBE/SDD
converged: YES YES NO NO
title: Mulliken charges:
elementType: O O O C C C C C C C C C C C C C C C C C C H H H H H H H H H H H H H H H H H H H H H H H H
charge: -0.468439 -0.447537 -0.439920 0.411673 -0.108376 -0.236176 -0.136172 -0.212531 -0.528140 -0.568682 -0.480352 -0.476383 -0.137671 -0.830924 0.248704 -0.584966 0.299573 -0.352662 -0.527279 -0.446029 0.285700 0.225941 0.237500 0.232954 0.222074 0.249501 0.196686 0.215255 0.237825 0.216148 0.190618 0.223876 0.210653 0.211287 0.218905 0.235544 0.228956 0.219575 0.250569 0.334469 0.225986 0.331492 0.253648 0.216067 0.351061
chargesum: 0.00000
title: Mulliken charges with hydrogens summed into heavy atoms:
elementType: O O O C C C C C C C C C C C C C C C C C C
charge: -0.133970 -0.116045 -0.088858 0.411673 0.117564 0.001323 0.096782 0.009543 -0.081954 -0.115602 -0.073587 -0.041854 0.073616 -0.147519 0.248704 -0.114822 0.299573 -0.126677 -0.273631 -0.229962 0.285700
polarizability: 2.60284463e+02 -7.87435159e+00 1.88317684e+02 4.79916867e+00 8.63262447e+00 1.37561427e+02
1716.lowfreq: -2.8023 0.0004 0.0005 0.0006 8.8637 13.4360 31.6907 60.3079 86.1529
frequency: 31.5786 60.3028 86.1438 95.6598 112.8903 137.3864 169.9911 180.5158 189.6183 214.5935 240.5673 248.1871 258.8786 267.6192 288.0790 301.7330 305.5354 331.6455 337.1172 352.5195 391.6146 404.9906 419.4548 434.5726 448.3847 455.5951 477.0114 516.2186 518.1492 527.8182 563.3964 583.5132 619.6287 682.6521 701.9477 708.0705 752.2978 772.2277 775.8826 786.4314 810.5364 823.5161 847.4668 867.5652 876.9160 888.2072 907.2639 923.3505 928.2042 932.7510 939.1940 959.1800 982.3105 1004.2171 1022.1197 1028.3783 1030.7241 1053.3421 1075.7616 1089.9678 1100.1536 1116.2088 1121.8561 1136.3842 1147.8494 1159.2275 1165.4934 1174.5582 1181.6495 1189.3355 1199.6744 1211.9862 1215.5948 1230.4052 1239.8960 1252.0208 1256.2295 1263.1374 1273.1661 1281.6740 1292.4151 1293.8465 1304.7248 1312.0866 1326.1493 1336.4855 1338.0876 1347.2982 1357.1577 1360.6310 1366.7165 1382.5281 1391.0508 1394.2136 1437.3758 1446.0109 1455.3763 1464.3130 1475.9168 1476.5798 1487.8103 1494.8572 1497.2101 1589.2112 1632.0927 2931.5140 2934.4151 2944.5471 2966.4378 2972.0547 2974.9630 2980.3048 2981.0638 2987.0772 2989.6589 3005.8056 3030.0869 3036.9385 3041.5006 3054.6545 3063.3747 3068.3106 3083.8458 3110.5383 3141.1750 3153.0783 3551.6773 3570.6895 3583.2083
redmass: 4.3765 4.3332 4.3253 4.1138 1.9012 4.2355 1.3681 3.3091 4.1620 3.3358 2.5506 2.9925 1.5073 2.3093 1.1237 4.4650 2.6906 2.9439 1.1261 2.9627 2.4633 3.5023 3.5564 2.8918 3.0821 3.6497 3.3980 4.7488 2.8338 4.0979 3.1444 4.0685 3.9132 2.5657 4.8439 3.9137 3.8791 2.0383 3.2158 1.7996 2.3260 2.4232 2.0770 2.2359 2.0537 1.8197 2.7221 1.6108 1.9421 1.8694 2.3126 2.2341 2.1584 2.2514 2.5070 1.9585 2.4930 2.5414 2.4969 1.7389 2.0681 2.0793 1.7856 1.4576 1.5467 1.5537 1.5068 1.4404 1.4178 1.3276 1.8192 1.2070 1.4752 1.2819 1.5524 1.5132 2.6455 1.6336 1.4862 1.3355 1.3214 1.4242 1.5103 1.4456 1.4085 1.6023 1.3712 1.5565 1.5221 1.4231 1.5135 2.8935 1.2786 1.9405 1.2652 2.4661 1.0756 1.0781 1.0888 1.0792 1.0800 1.2513 1.9796 7.2783 6.4710 1.0805 1.0786 1.0817 1.0836 1.0760 1.0630 1.0440 1.0682 1.0598 1.0608 1.0654 1.0998 1.0964 1.1015 1.0991 1.1019 1.0995 1.0976 1.0892 1.0916 1.0933 1.0656 1.0663 1.0660
irintensity: 0.6367 0.5864 0.4031 0.1700 0.2060 2.1628 0.7911 5.0593 2.5654 4.1800 6.5662 3.1362 84.5688 21.8974 148.3123 13.0031 11.4810 0.5766 138.4793 22.4653 0.2183 3.1725 0.5102 3.7803 3.8012 2.5368 11.9830 2.7084 5.6463 1.2687 10.7076 4.8582 8.5053 2.4509 4.1606 2.0982 16.1965 3.7701 6.9382 28.0445 14.4504 2.9853 29.0533 1.2438 11.8150 16.1131 24.4019 9.6075 7.1502 2.7426 10.8866 19.5651 5.3878 4.8465 59.5285 10.5250 6.1585 32.5052 6.2537 9.2577 25.8985 20.0934 14.9173 45.7184 73.4083 2.4157 50.7737 41.9642 8.4464 29.5761 14.0631 6.2727 16.0957 10.3178 12.5412 7.1067 32.8267 5.9167 21.5310 13.8134 5.0274 1.4542 2.9091 20.5511 1.3791 3.6726 4.3857 0.4655 1.8043 7.4472 5.9495 21.6077 25.2640 1.9613 10.4513 5.5109 6.9763 5.0588 9.6277 11.2183 8.3200 42.0683 62.7735 29.5304 48.5565 2.4549 15.1405 42.6888 34.4586 13.2667 24.1908 6.0528 66.3029 84.5105 47.1868 62.6201 32.7741 11.9940 6.1696 25.3303 70.0187 34.0470 33.9750 22.3084 11.0504 14.5153 1.5174 2.1659 35.8473
temp: 298.150 k
press: 1.00000 atm
elementType: 8 8 8 6 6 6 6 6 6 6 6 6 6 6 6 6 6 6 6 6 6 1 1 1 1 1 1 1 1 1 1 1 1 1 1 1 1 1 1 1 1 1 1 1 1
symmnumber: 1
zpe: 1005311.5 jmol-1
zpe.correction: 0.382903 hartree
zpe.thermalcorrener: 0.402175 hartree
zpe.thermalcorrenthalpy: 0.403119 hartree
zpe.thermalcorrgfe: 0.337079 hartree
zpe.sumelectzpe: -924.388268 hartree
zpe.sumelectthermal: -924.368997 hartree
zpe.sumelectthermalent: -924.368053 hartree
zpe.sumelectthermalfe: -924.434092 hartree
dipole: -3.6757 -1.3649 1.6062
dipole: 4.2371
quadrupole: -109.9498 -122.1504 -129.9635
quadrupole: -14.8001 -0.5700 3.0054
quadrupole: 10.7381 -1.4625 -9.2756 -14.8001 -0.5700 3.0054
hfenergy: -924.7711714 hartree
pointgroup: C01 [X(C18H24O3)]
dipole: -1.4499007 -0.5157461 0.640886 debye
polarizability: 260.1904106|-8.0954307|188.7613978|5.2967474|7.4044085|137.2117657 unknown
InChI: InChI=1S/C18H24O3/c1-18-7-6-13-12-3-2-11(19)8-10(12)9-15(20)17(13)14(18)4-5-16(18)21/h2-3,8,13-17,19-21H,4-7,9H2,1H3
charge 0 multiplicity 1
45 atoms
O  -4.321433 -0.682892 -1.442694
O  0.004779 2.263247 -1.54051
O  5.910207 -0.171142 0.35768
C  -2.692458 -0.815742 0.379321
C  -2.063116 0.55427 -0.034865
C  -0.559443 0.635066 0.284119
C  0.186172 -0.50915 -0.47112
C  -4.182656 -0.556384 0.025088
C  -1.984151 -1.940763 -0.4089
C  -3.031752 1.608959 0.560708
C  -0.447178 -1.901789 -0.187967
C  -4.437561 0.912968 0.498882
C  0.061818 2.004425 -0.082077
C  -2.613065 -1.088972 1.906893
C  1.696567 -0.450263 -0.206426
C  1.540854 2.079263 0.312561
C  2.329063 0.787494 0.118249
C  2.515476 -1.600289 -0.335676
C  3.729917 0.84078 0.299183
C  3.913621 -1.552272 -0.155282
C  4.520894 -0.316337 0.163204
H  -2.180597 0.586006 -1.141847
H  -0.412486 0.50853 1.378183
H  0.038658 -0.294242 -1.553731
H  -4.866413 -1.275984 0.522289
H  -2.214452 -1.81664 -1.4828
H  -2.37209 -2.934689 -0.108522
H  -3.019956 2.561064 0.000433
H  -2.756416 1.846985 1.605778
H  -0.195369 -2.213188 0.84562
H  0.007417 -2.656992 -0.857198
H  -4.9309 0.92515 1.487971
H  -5.115569 1.430401 -0.205347
H  -0.494751 2.810783 0.443261
H  -3.131388 -2.037217 2.14426
H  -1.571372 -1.188418 2.255419
H  -3.08553 -0.289602 2.505689
H  1.602631 2.37669 1.378982
H  2.00682 2.89689 -0.268812
H  -5.247335 -0.441963 -1.695846
H  2.061251 -2.563792 -0.585962
H  -0.934163 2.162881 -1.84168
H  4.224431 1.787445 0.543646
H  4.516803 -2.463365 -0.263502
H  6.37092 -1.036209 0.224346
