program: Gaussian 09
title: 000151098
version: EM64L-G09RevD.01
frameworkgroup: C1[X(C11H12BrNO3S)]
method: RPBEPBE
basis: SDD
operation: Freq
keyword: #p
keyword: freq=noraman
keyword: PBEPBE/SDD
title: #p freq=noraman PBEPBE/SDD
converged: YES YES NO NO
title: Mulliken charges:
elementType: Br S O O O N C C C C C C C C C C C H H H H H H H H H H H H
charge: 0.008467 0.175465 -0.424448 -0.237715 -0.276491 -0.388428 -0.123837 -0.679402 0.185124 -0.156996 0.266274 -0.261026 -0.196283 -0.771433 -0.171477 -0.200564 -0.201109 0.303179 0.324181 0.295241 0.345481 0.258055 0.294660 0.256427 0.255952 0.216536 0.253909 0.254211 0.396046
chargesum: 0.00000
title: Mulliken charges with hydrogens summed into heavy atoms:
elementType: Br S O O O N C C C C C C C C C C C
charge: 0.008467 0.175465 -0.028402 -0.237715 -0.276491 -0.042947 0.179341 -0.059980 0.185124 -0.156996 0.266274 -0.002971 0.098377 -0.042517 0.082432 0.053647 -0.201109
polarizability: 2.71889941e+02 1.52039166e+01 1.37974328e+02 4.60666142e+00 1.00249235e+01 1.09516013e+02
1716.lowfreq: -11.7387 -4.8534 -0.0020 -0.0017 -0.0012 5.0980 14.4855 23.8304 38.1623
frequency: 13.9783 23.7694 38.0692 48.9628 52.6752 62.8331 67.7624 99.9021 108.1886 145.7573 169.1827 194.3216 245.4513 252.5775 290.6239 316.4555 342.9280 356.6523 409.5126 444.6374 468.1848 490.6548 505.0941 514.9120 553.0802 595.4803 611.0589 616.8088 623.1024 653.5368 697.2600 700.6167 720.6404 816.9005 826.4561 837.7582 902.6141 943.8561 954.9876 975.4105 978.7824 984.6442 994.2025 1044.0841 1055.0511 1071.5688 1077.4669 1110.4861 1134.2413 1184.3871 1191.4595 1219.9553 1245.2757 1285.2348 1292.1310 1318.2781 1328.5967 1351.7444 1380.2657 1389.5262 1433.2872 1449.6321 1456.0594 1463.0044 1480.3802 1570.1226 1571.1016 1608.8898 1663.4602 2966.0905 2999.3196 3055.9371 3098.1289 3105.5595 3136.8247 3139.3165 3150.0598 3169.6345 3174.4145 3523.7103 3568.4216
redmass: 2.9139 5.1085 2.1467 2.7534 5.1793 8.8221 5.2704 6.1029 9.5107 5.3739 6.3361 6.3122 4.2107 14.9345 6.6425 4.5278 3.7292 3.8365 2.9490 4.9229 4.1809 3.3009 4.0702 4.0434 1.3482 2.9758 3.4973 4.1172 4.1510 1.7022 4.7484 5.8222 4.5220 2.5561 1.5603 1.2980 2.3697 4.4401 1.3262 1.7154 1.8587 5.7322 1.6061 1.6556 5.5753 2.0592 1.7873 1.4091 1.9969 1.6098 1.1297 1.3730 1.4992 1.7050 1.2671 1.3759 2.2290 4.9363 3.5373 1.2291 1.0980 1.0497 2.0352 1.2014 1.7819 7.5889 6.0122 6.2859 9.2333 1.0802 1.0360 1.0576 1.0984 1.1005 1.1077 1.0917 1.0890 1.0952 1.0970 1.0643 1.0786
irintensity: 0.4605 0.3567 0.3062 4.6256 3.3191 5.6559 7.0969 2.7708 1.2151 7.4808 2.5404 0.8349 2.1895 4.0040 0.0369 0.8777 3.6857 0.4300 0.2740 6.6099 18.6870 32.9306 25.0988 45.9443 90.4344 48.6343 6.7568 9.9566 24.8030 154.7665 2.9143 3.2271 10.1536 17.8514 39.4644 25.4237 17.0523 28.6935 0.1725 22.9878 30.6197 95.6927 7.3661 14.3696 4.4829 57.7862 186.2984 8.5793 17.6438 12.3471 0.4033 3.2087 11.1893 88.6485 6.2095 25.1923 30.8512 2.4106 9.4192 73.1503 23.1035 23.5148 158.0826 113.9934 223.9735 0.4389 1.9703 151.1256 205.3190 16.6830 8.6978 4.4947 10.1383 15.5823 0.9188 5.5840 1.7216 3.7965 4.4683 42.7701 47.3448
temp: 298.150 k
press: 1.00000 atm
elementType: 35 16 8 8 8 7 6 6 6 6 6 6 6 6 6 6 6 1 1 1 1 1 1 1 1 1 1 1 1
symmnumber: 1
zpe: 556941.8 jmol-1
zpe.correction: 0.212128 hartree
zpe.thermalcorrener: 0.230312 hartree
zpe.thermalcorrenthalpy: 0.231256 hartree
zpe.thermalcorrgfe: 0.160952 hartree
zpe.sumelectzpe: -1117.074202 hartree
zpe.sumelectthermal: -1117.056018 hartree
zpe.sumelectthermalent: -1117.055074 hartree
zpe.sumelectthermalfe: -1117.125378 hartree
dipole: -2.5625 1.1239 -3.2180
dipole: 4.2644
quadrupole: -117.8825 -109.3866 -119.3062
quadrupole: -7.9770 16.0770 0.8650
quadrupole: -2.3574 6.1385 -3.7811 -7.9770 16.0770 0.8650
hfenergy: -1117.2863299 hartree
pointgroup: C01 [X(C11H12Br1N1O3S1)]
dipole: -1.0099589 -0.3228302 1.3002482 debye
polarizability: 265.2424774|-31.4598208|143.8843872|-9.3657484|12.1159295|110.2534176 unknown
InChI: InChI=1S/C11H12BrNO3S/c1-7(14)13-10(11(15)16)6-17-9-4-2-8(12)3-5-9/h2-5,10,13,15H,6H2,1H3
charge 0 multiplicity 1
29 atoms
Br 6.365581 -0.8444 -0.405903
S  0.12534 1.053884 0.720312
O  -2.382905 -1.882876 1.38772
O  -0.813027 -2.395588 -0.241889
O  -3.858981 1.581339 -1.47902
N  -3.04624 0.451615 0.370708
C  -2.093419 -0.304692 -0.446952
C  -0.841187 0.521447 -0.830336
C  -1.6806 -1.618613 0.209771
C  1.837064 0.485192 0.330594
C  -3.901249 1.365118 -0.227485
C  2.895851 1.374666 0.633292
C  2.12022 -0.802828 -0.184157
C  -4.868806 2.082227 0.703931
C  4.238577 0.982743 0.428685
C  3.459575 -1.192962 -0.412764
C  4.503012 -0.297492 -0.098869
H  -2.59928 -0.549733 -1.406339
H  -1.164195 1.430768 -1.358541
H  -0.166108 -0.066194 -1.470569
H  -3.113036 0.228889 1.364725
H  2.676567 2.376005 1.017412
H  1.314416 -1.514128 -0.395959
H  -4.648903 3.163947 0.690992
H  -5.896069 1.953912 0.322813
H  -4.822933 1.722825 1.746056
H  5.055117 1.67121 0.663676
H  3.678311 -2.186577 -0.814169
H  -2.069494 -2.742006 1.780267
