program: Gaussian 09
title: 000151094
version: EM64L-G09RevD.01
frameworkgroup: C1[X(C21H16O)]
method: RPBEPBE
basis: SDD
operation: Freq
keyword: #pfreq=noraman
keyword: PBEPBE/SDD
title: #p freq=noraman PBEPBE/SDD
converged: YES YES NO NO
title: Mulliken charges:
elementType: O C C C C C C C C C C C C C C C C C C C C C H H H H H H H H H H H H H H H H
charge: -0.460051 0.022617 -0.221481 -0.533792 0.181226 -0.536612 0.355837 0.657105 0.292976 0.379068 -0.744159 -0.496734 0.120819 -0.470081 -0.474642 0.423553 -0.507248 -0.489677 -0.340075 -0.441698 -0.263825 -0.253084 0.236432 0.233666 0.222865 0.267439 0.232681 0.241617 0.221065 0.244795 0.198692 0.208367 0.232421 0.221297 0.239945 0.226441 0.228359 0.343874
chargesum: 0.00000
title: Mulliken charges with hydrogens summed into heavy atoms:
elementType: O C C C C C C C C C C C C C C C C C C C C C
charge: -0.116177 0.022617 -0.221481 -0.063695 0.181226 -0.046309 0.355837 0.657105 0.292976 0.379068 -0.511477 -0.255117 0.120819 -0.249016 -0.229846 0.423553 -0.100189 -0.257256 -0.118777 -0.201752 -0.037385 -0.024724
polarizability: 4.49201854e+02 4.70414585e+00 2.45864255e+02 7.62568773e+00 -5.72623678e-03 9.93974288e+01
1716.lowfreq: -2.5110 -0.0008 -0.0007 -0.0002 5.4157 6.8654 33.1887 49.9811 58.5221
frequency: 33.0848 49.9613 58.5182 97.4856 112.7054 140.8308 158.2721 194.8960 206.4635 231.7941 254.8152 281.7693 287.1338 295.2824 342.5213 403.4883 418.9503 446.6240 455.3858 492.7091 507.3958 522.1145 535.8684 555.2406 565.4229 568.2889 609.4383 614.3279 637.0565 641.3957 708.1335 741.6880 757.3963 760.5083 771.3228 794.2282 805.3148 820.1715 824.3325 859.3873 863.5928 885.8852 896.8968 918.7976 941.1602 950.6877 954.1581 962.0008 974.3896 979.0795 989.8573 1004.0282 1017.5509 1034.7001 1045.8385 1086.5947 1125.1299 1139.1219 1157.1287 1159.6773 1178.2759 1183.6219 1195.9739 1209.1681 1213.0552 1232.2132 1239.0989 1243.0389 1250.7328 1273.9486 1281.4904 1323.4852 1342.8120 1370.2982 1392.2027 1405.2962 1405.9329 1411.3646 1435.6674 1451.1516 1461.1057 1465.5355 1470.1147 1473.1886 1486.8122 1509.2096 1552.9316 1582.6314 1607.7007 1619.8531 1625.7682 1631.5475 2925.9638 2983.4013 2985.8621 2997.9192 3029.3519 3062.4138 3112.4721 3119.6446 3121.4270 3131.2875 3139.8753 3141.8650 3146.0945 3152.0708 3165.0107 3547.2399
redmass: 5.2858 4.3682 3.9133 4.4997 1.8828 4.0378 4.8434 3.6533 3.3847 2.4495 1.3444 4.1881 3.7752 4.8099 4.5761 4.1702 3.9361 5.1082 3.3792 4.8452 4.2743 5.0348 3.5162 2.8597 3.2142 4.9467 5.0695 6.1247 4.8425 5.5122 3.0977 5.3998 1.3172 1.7844 3.8443 1.9338 3.9251 1.6586 1.9628 1.8678 4.2160 1.7232 4.4685 2.3552 7.0222 3.2749 1.4010 1.5844 1.8103 1.3892 1.3724 2.0579 5.8753 2.9418 2.2102 2.3384 2.1465 1.1867 1.3536 1.4395 1.0867 1.2629 1.1083 1.7148 1.2094 1.8077 1.6093 1.4949 1.8172 1.7956 1.6992 3.1466 3.9022 3.1306 2.7859 2.7889 2.5637 2.0492 2.2674 1.5997 2.4825 1.5207 1.9338 1.1218 4.1184 3.8118 5.9535 9.0081 6.3315 6.9040 7.1914 8.1509 1.0590 1.0610 1.1017 1.0665 1.1003 1.0972 1.0866 1.0861 1.0858 1.0888 1.0954 1.0929 1.0981 1.0923 1.0990 1.0663
irintensity: 1.0717 4.3062 0.0483 1.5349 0.5523 2.6813 1.8607 3.5173 3.8099 45.3726 100.8710 7.6218 1.4906 3.1872 0.8084 2.6605 3.9387 3.3125 4.1408 1.4221 8.2651 1.8658 1.8089 0.7216 5.5963 1.3198 1.3178 0.3376 0.8797 13.8609 6.2645 0.7617 39.5250 16.4616 15.8008 5.9353 3.6127 6.8996 72.2840 31.4161 2.5130 1.8609 4.3019 36.1769 57.6432 2.8034 2.6831 5.8554 5.8231 1.8705 0.6130 0.5480 1.5060 1.0567 12.1583 4.1866 6.6059 0.3547 11.5093 26.4954 1.0211 7.3965 0.3994 5.9106 26.0185 2.5981 4.6050 3.6016 4.8775 3.6190 2.4676 0.0144 11.3703 10.0668 1.4544 6.0203 4.3137 16.7270 9.4228 0.5423 9.0649 6.7644 5.6770 7.1676 4.5627 13.6464 3.5122 14.9864 2.5640 4.9803 6.2866 15.8594 89.0861 22.2451 42.8253 43.2551 10.2166 13.3390 9.9270 0.1379 4.4705 8.0527 31.3565 8.6945 27.8606 33.5316 42.5275 8.6174
temp: 298.150 k
press: 1.00000 atm
elementType: 8 6 6 6 6 6 6 6 6 6 6 6 6 6 6 6 6 6 6 6 6 6 1 1 1 1 1 1 1 1 1 1 1 1 1 1 1 1
symmnumber: 1
zpe: 795128.6 jmol-1
zpe.correction: 0.302849 hartree
zpe.thermalcorrener: 0.319731 hartree
zpe.thermalcorrenthalpy: 0.320675 hartree
zpe.thermalcorrgfe: 0.258131 hartree
zpe.sumelectzpe: -883.599004 hartree
zpe.sumelectthermal: -883.582121 hartree
zpe.sumelectthermalent: -883.581177 hartree
zpe.sumelectthermalfe: -883.643722 hartree
dipole: -1.8952 0.6140 -1.3684
dipole: 2.4169
quadrupole: -96.1193 -110.9265 -136.5010
quadrupole: -1.6875 7.4405 -0.4048
quadrupole: 18.3963 3.5891 -21.9854 -1.6875 7.4405 -0.4048
hfenergy: -883.9018523 hartree
pointgroup: C01 [X(C21H16O1)]
dipole: -0.736559 0.2872629 -0.5283334 debye
polarizability: 449.2438371|-1.4179327|245.4644687|8.8730442|6.5774785|99.7552312 unknown
InChI: InChI=1S/C21H16O/c22-12-15-6-5-14-11-20-16-4-2-1-3-13(16)7-8-18(20)19-10-9-17(15)21(14)19/h1-8,11,22H,9-10,12H2
charge 0 multiplicity 1
38 atoms
O  -5.75191 0.472227 0.931843
C  -0.722516 1.22253 -0.036215
C  -1.558696 0.087229 -0.103114
C  -1.590398 2.479233 -0.023213
C  -2.943977 0.426535 -0.141557
C  -3.073623 1.945582 -0.073666
C  0.679567 1.057028 0.003409
C  -1.059846 -1.255149 -0.136577
C  1.227525 -0.303593 -0.026356
C  -3.894332 -0.596239 -0.209671
C  0.353139 -1.417784 -0.095889
C  -2.054324 -2.292406 -0.205232
C  2.693473 -0.465641 0.018398
C  -3.413191 -1.958336 -0.236927
C  1.575885 2.192633 0.072715
C  3.536871 0.702455 0.086953
C  -5.376637 -0.307858 -0.271578
C  2.943227 2.025383 0.112342
C  3.331037 -1.742982 -0.002549
C  4.956095 0.554232 0.130815
C  4.728237 -1.870375 0.041339
C  5.552625 -0.713496 0.108623
H  -1.415144 3.085399 0.886065
H  -1.367158 3.134372 -0.887178
H  -3.619769 2.348477 -0.948541
H  -3.652792 2.240891 0.818362
H  0.758132 -2.434284 -0.119522
H  -1.747156 -3.344368 -0.226917
H  -4.157595 -2.763883 -0.277209
H  1.140301 3.197829 0.094279
H  -5.613755 0.280776 -1.185898
H  -5.946151 -1.259493 -0.311681
H  3.611764 2.89296 0.165035
H  2.727876 -2.654336 -0.053235
H  5.577606 1.456266 0.182883
H  5.184596 -2.866269 0.023845
H  6.642736 -0.815363 0.142906
H  -6.696424 0.761318 0.845014
