program: Gaussian 09
title: 000151092
version: EM64L-G09RevD.01
frameworkgroup: C1[X(C13H19ClNO5P)]
method: RPBEPBE
basis: SDD
operation: Freq
keyword: #p
keyword: freq=noraman
keyword: PBEPBE/SDD
title: #p freq=noraman PBEPBE/SDD
converged: YES YES NO NO
title: Mulliken charges:
elementType: Cl P O O O O O N C C C C C C C C C C C C C H H H H H H H H H H H H H H H H H H H
charge: -0.068269 1.264756 -0.529613 -0.686542 -0.606872 -0.209936 -0.205811 0.025216 -0.310041 -0.788391 -0.352818 -0.318394 -0.226845 -0.565711 -0.601723 0.474000 -0.397251 -0.333482 -0.353423 -0.371124 0.369159 0.236787 0.233144 0.291414 0.262749 0.193841 0.198084 0.228530 0.224715 0.208526 0.233823 0.246365 0.218263 0.257139 0.261792 0.394914 0.244589 0.282238 0.286305 0.289898
chargesum: 0.00000
title: Mulliken charges with hydrogens summed into heavy atoms:
elementType: Cl P O O O O O N C C C C C C C C C C C C C
charge: -0.068269 1.264756 -0.529613 -0.291629 -0.606872 -0.209936 -0.205811 0.025216 0.159890 -0.234228 0.039106 0.134852 0.215505 -0.101083 -0.082792 0.474000 -0.152663 -0.051244 -0.067118 -0.081226 0.369159
polarizability: 2.63487476e+02 -1.31489308e+01 1.72707184e+02 -1.02196546e+01 -2.75938810e+01 1.60555986e+02
1716.lowfreq: -10.5931 -3.6612 -0.0018 -0.0016 -0.0015 3.0701 5.3585 6.8801 19.8700
frequency: -8.6174 6.5590 19.7137 30.3424 34.8905 48.0431 60.0169 68.8946 70.4394 101.4369 117.2500 125.1797 131.3602 133.8521 166.5172 175.6958 203.2571 222.0382 238.5372 248.6908 304.4457 321.0819 330.7912 343.7006 344.9927 368.2187 407.3196 409.5801 424.1179 439.2917 506.3090 527.4828 594.5106 620.3280 627.3932 672.9710 681.8458 692.7510 730.7335 734.0448 746.3756 747.7064 764.3123 803.1816 816.1176 853.2298 859.2009 875.1931 926.6859 955.9918 978.2695 985.1036 989.3620 997.0025 1007.2489 1007.6890 1022.8002 1044.2725 1055.8354 1068.3691 1071.4832 1083.4562 1092.3003 1107.7560 1111.6042 1177.1842 1182.5048 1214.8277 1217.4759 1221.7008 1224.1695 1228.0489 1262.5831 1272.7396 1293.6244 1303.9192 1306.8474 1308.0641 1326.6348 1349.1485 1358.9275 1362.7805 1366.3265 1401.3833 1419.5017 1419.7362 1456.3194 1458.4409 1469.3408 1473.9393 1476.3755 1483.5181 1489.1599 1595.4328 1607.8910 2962.8149 2974.4280 2992.1610 2998.8841 3001.0718 3009.4844 3020.2054 3045.4728 3048.6702 3050.0015 3062.4410 3063.5744 3090.7952 3127.6483 3135.9460 3160.6878 3180.7247 3183.4365 3590.1947
redmass: 4.7286 9.5475 6.4497 4.9557 2.6267 6.5401 5.0923 5.1271 4.5905 4.4235 2.6886 4.2185 6.1155 2.5005 3.7001 9.6200 4.3230 3.2202 4.1440 5.4126 2.4062 6.0579 5.9094 2.5504 1.9395 5.3571 3.9481 3.0074 3.4934 4.6279 6.7679 3.3839 5.4049 4.6847 6.7733 4.4409 6.8299 8.6803 4.1014 5.3597 1.4764 2.0058 1.1622 6.4577 1.2701 1.2828 1.6080 2.6079 1.3386 2.4467 1.6066 1.4473 2.0853 1.3739 4.1590 3.0864 3.4826 1.7008 2.3963 2.5885 1.6652 2.7010 3.2301 1.6419 1.3729 1.1579 1.3703 1.5867 1.8647 3.7984 1.2509 1.2885 1.2373 1.2171 1.0799 1.2901 1.1773 1.1695 1.4787 1.3912 1.3440 1.5587 4.4990 7.7925 1.3395 2.0373 1.0969 1.1186 1.0689 1.1841 1.0932 2.0222 1.0968 7.6440 6.2706 1.0587 1.0593 1.0596 1.0595 1.0610 1.1008 1.0573 1.0563 1.1038 1.1034 1.1045 1.1024 1.1044 1.1114 1.0906 1.0897 1.0948 1.0963 1.0661
irintensity: 3.2305 0.1061 0.7254 0.8279 0.2282 0.8462 1.4144 0.0710 0.1052 2.5974 0.5629 0.5111 6.3950 1.2832 5.1409 2.7174 2.7348 13.5571 5.9231 0.4860 15.9742 14.5776 47.6666 45.1478 61.4277 3.4228 10.8897 0.7672 1.9857 33.0034 1.0437 2.0002 10.2484 33.1838 0.4142 31.0126 33.8443 265.1141 27.0377 24.9873 15.1748 16.0536 5.1183 11.0044 10.3819 8.1197 100.9436 50.1267 6.3526 64.4068 42.9947 9.7353 42.3731 0.2219 1.9361 4.4406 9.1630 22.2712 50.7240 1.8386 42.5473 8.2488 16.9011 51.7575 42.9569 4.6883 60.8547 5.5027 4.6631 234.5513 29.5020 8.6300 21.9652 3.2177 0.9902 0.6418 8.1643 4.8995 5.3257 7.9378 17.0061 13.4557 72.5069 0.1064 29.0408 26.3771 2.5969 15.6059 0.1213 6.9022 1.2891 13.3572 16.4328 1.2263 47.8326 20.0233 30.7985 3.5050 22.6723 16.6830 9.9155 11.1671 28.5024 2.7745 50.5089 35.9023 14.8257 14.5841 26.0036 10.9639 1.2684 0.0804 3.6142 69.4482
temp: 298.150 k
press: 1.00000 atm
elementType: 17 15 8 8 8 8 8 7 6 6 6 6 6 6 6 6 6 6 6 6 6 1 1 1 1 1 1 1 1 1 1 1 1 1 1 1 1 1 1 1
symmnumber: 1
zpe: 811560.7 jmol-1
zpe.correction: 0.309107 hartree
zpe.thermalcorrener: 0.331868 hartree
zpe.thermalcorrenthalpy: 0.332812 hartree
zpe.thermalcorrgfe: 0.251887 hartree
zpe.sumelectzpe: -1737.243672 hartree
zpe.sumelectthermal: -1737.220912 hartree
zpe.sumelectthermalent: -1737.219968 hartree
zpe.sumelectthermalfe: -1737.300893 hartree
dipole: 7.2302 0.4515 -4.7513
dipole: 8.6634
quadrupole: -162.0467 -142.8117 -142.8633
quadrupole: 16.8291 -5.6920 6.6453
quadrupole: -12.8061 6.4289 6.3773 16.8291 -5.6920 6.6453
hfenergy: -1737.5527793 hartree
pointgroup: C01 [X(C13H19Cl1N1O5P1)]
dipole: -2.7245296 0.7436849 1.9082173 debye
polarizability: 264.6880583|-7.285024|169.7500516|-4.7454524|29.476878|162.312536 unknown
InChI: InChI=1S/C13H19ClNO5P/c14-9-2-1-3-11-21(18,19)20-10-8-12-4-6-13(7-5-12)15(16)17/h4-7,18H,1-3,8-11H2
charge 0 multiplicity 1
40 atoms
Cl 4.251254 -4.199524 -0.386232
P  -3.392867 -1.248851 -0.302868
O  -2.947789 0.42752 -0.528022
O  -4.678164 -1.194481 0.876874
O  -3.756703 -1.926849 -1.691019
O  4.080392 2.679954 0.775566
O  3.873755 1.457646 -1.139622
N  3.374713 2.135486 -0.159921
C  -0.725225 -2.170641 -0.114443
C  -2.020663 -2.003995 0.708446
C  0.373043 -2.891761 0.701205
C  1.655767 -3.122971 -0.137217
C  -3.104468 1.414944 0.565299
C  -2.410809 2.708552 0.095082
C  2.728179 -3.84581 0.679109
C  -0.89916 2.584042 0.01213
C  -0.070315 3.149592 1.017395
C  -0.289906 1.874525 -1.059198
C  1.33115 3.011191 0.971153
C  1.108485 1.724166 -1.1241
C  1.900995 2.293885 -0.102459
H  -0.94385 -2.750036 -1.032412
H  -0.354466 -1.179474 -0.439525
H  -2.402952 -2.981263 1.054456
H  -1.866024 -1.363299 1.595074
H  -0.015617 -3.86806 1.057951
H  0.617458 -2.296735 1.60538
H  2.056426 -2.155673 -0.495712
H  1.410818 -3.724443 -1.033061
H  -2.651025 1.037671 1.50451
H  -4.181008 1.594681 0.740239
H  -2.835934 2.971505 -0.891019
H  -2.691041 3.513255 0.800989
H  2.392012 -4.831955 1.036279
H  3.099259 -3.241138 1.521151
H  -5.586405 -1.233775 0.481619
H  -0.526566 3.70881 1.842534
H  -0.925492 1.435259 -1.833822
H  1.982267 3.443705 1.735361
H  1.593875 1.185945 -1.942749
