program: Gaussian 09
title: 000151090
version: EM64L-G09RevD.01
frameworkgroup: C1[X(C19H23N3S)]
method: RPBEPBE
basis: SDD
operation: Freq
keyword: #p
keyword: freq=noraman
keyword: PBEPBE/SDD
title: #p freq=noraman PBEPBE/SDD
converged: YES YES NO NO
title: Mulliken charges:
elementType: S N N N C C C C C C C C C C C C C C C C C C C H H H H H H H H H H H H H H H H H H H H H H H
charge: 0.213628 -0.111398 -0.294266 -0.286329 -0.334131 -0.323937 -0.314288 -0.434592 -0.421803 -0.420760 -0.406224 0.497998 0.480082 -0.354206 -0.349436 -0.332485 -0.324326 -0.268683 -0.269334 -0.241257 -0.244860 -0.256642 -0.255768 0.187701 0.226560 0.190772 0.216555 0.193415 0.192636 0.203637 0.239995 0.192564 0.206397 0.205968 0.182363 0.205802 0.249898 0.266351 0.239445 0.246479 0.246179 0.246775 0.225760 0.226550 0.230384 0.230833
chargesum: 0.00000
title: Mulliken charges with hydrogens summed into heavy atoms:
elementType: S N N N C C C C C C C C C C C C C C C C C C C
charge: 0.213628 -0.111398 -0.027915 -0.286329 0.080130 0.083390 0.071763 0.009040 -0.022842 -0.032429 0.049476 0.497998 0.480082 -0.354206 -0.349436 -0.093040 -0.077846 -0.022505 -0.022560 -0.015497 -0.018311 -0.026259 -0.024935
polarizability: 2.56781471e+02 -4.99968669e+01 2.71416307e+02 -3.57966422e+01 -1.40927625e+01 1.89680807e+02
1716.lowfreq: -19.7446 -11.1329 -8.0573 -0.0018 -0.0008 0.0006 9.0010 11.5887 23.2647
frequency: -12.1111 10.1993 23.2064 53.1008 57.6643 73.5808 113.1981 133.5514 154.6270 186.9780 226.2560 242.5648 247.9880 267.7739 305.6029 322.7573 328.4808 346.3031 365.6490 394.7684 397.9613 417.3705 421.8142 436.3328 442.5010 461.2183 479.6856 512.7485 526.4039 533.4592 541.1247 575.9381 613.1712 657.9264 673.3781 685.2124 716.6353 718.1426 724.4942 744.4195 749.6202 754.3887 818.1462 843.6243 848.9196 854.1870 864.4376 871.2147 891.2095 914.7452 928.7164 931.3569 969.0517 970.6277 974.8418 996.6936 1020.7432 1033.3865 1035.0935 1043.6924 1049.8330 1053.2609 1064.2053 1078.9735 1094.1506 1103.4325 1121.3569 1129.0739 1138.7545 1142.1144 1163.9924 1171.4727 1174.0445 1189.5517 1197.1061 1213.6549 1246.1616 1247.7425 1262.7118 1270.6353 1280.3537 1293.9687 1302.3484 1315.5963 1323.2265 1332.9645 1346.5773 1358.7190 1362.3794 1374.8057 1380.7816 1381.9499 1387.5348 1426.9095 1430.1705 1443.6814 1448.4095 1453.7326 1454.3723 1458.8378 1462.5501 1464.6705 1475.3023 1476.3039 1485.3105 1566.1689 1580.8784 1583.6260 1610.5018 2857.5453 2866.5041 2871.7879 2876.4621 2886.7158 2955.2794 2993.6585 3028.4862 3031.3455 3036.2112 3037.8929 3042.1256 3051.3694 3076.1251 3130.6273 3131.1027 3141.1816 3141.3948 3157.5403 3158.8752 3169.9262 3170.9138 3458.4161
redmass: 3.4471 5.4411 3.9956 4.6160 5.3898 4.2551 3.7778 4.2698 3.9200 3.5252 4.5952 2.9731 2.5821 2.5471 2.8822 2.8196 4.0673 2.9832 3.2178 3.0707 3.7624 4.1603 4.3391 3.2165 3.3933 2.8382 3.0652 2.4364 4.0355 4.8927 1.9681 3.7457 5.3227 5.9264 6.2397 1.7183 3.4215 3.8729 3.4102 3.2031 1.3264 1.3855 1.8260 1.5082 1.4106 1.3645 2.9491 3.4260 2.7423 2.2000 1.3753 1.3725 1.3125 1.4044 1.8685 2.4772 6.8213 2.9796 2.9014 2.1945 1.8126 1.8718 1.8327 2.7821 2.7005 2.3924 1.6603 2.2045 2.4588 1.6121 3.2631 1.0609 1.0725 1.1123 1.1249 1.3797 2.4119 1.4184 1.4328 1.3697 1.8054 1.2931 1.2826 1.2601 1.7603 1.4207 1.4020 1.6025 1.4314 3.5236 1.4089 8.5723 1.4349 2.2946 2.3261 1.3251 1.0912 1.0839 1.1477 2.1382 1.1544 1.1051 1.2896 1.6363 1.2619 6.0866 6.7926 6.6308 6.9725 1.0709 1.0698 1.0700 1.0703 1.0683 1.0682 1.0631 1.0894 1.0907 1.0874 1.0927 1.0892 1.0985 1.0932 1.0851 1.0851 1.0903 1.0900 1.0934 1.0937 1.1001 1.0998 1.0753
irintensity: 0.0164 0.1603 0.1564 0.1160 1.5106 0.3527 0.3342 1.1014 1.1044 4.6155 0.4325 1.0901 0.6646 3.0281 7.3227 1.5066 0.2744 3.5256 7.0247 2.1709 1.5118 4.0431 9.4317 3.3000 3.8231 1.1362 26.3982 29.7709 0.5131 5.7982 47.2869 7.3313 4.2573 2.9921 4.3455 83.6107 17.2615 11.0680 0.0936 32.1130 23.0165 141.8549 7.4220 0.1080 0.3910 1.2334 0.4446 9.9454 2.1989 0.5128 2.5336 3.5664 0.0624 7.0389 14.2917 16.0933 34.0013 8.6298 4.3025 10.3720 1.4948 2.4547 10.2919 1.1257 15.2759 1.4646 16.2138 19.6047 25.4354 26.1973 20.9291 0.4816 1.2867 7.9031 7.0049 65.3963 62.8036 10.6973 1.9626 4.4895 0.1714 14.0038 4.7711 41.6190 96.9962 18.4075 4.7165 12.6721 8.5907 3.7066 1.4585 4.5629 0.5136 5.0483 16.5729 1.5425 0.6659 1.3676 17.9522 299.3893 3.9709 6.1473 8.5161 28.0196 17.4011 0.6923 1.1529 37.4023 26.6263 80.0623 26.6252 40.6656 8.8009 325.1168 49.6749 40.9146 3.2775 30.5497 91.6817 56.2023 13.8011 47.5888 7.7676 2.7407 1.5019 10.1204 7.4586 19.3615 28.6681 29.4792 12.8017 1.5631
temp: 298.150 k
press: 1.00000 atm
elementType: 16 7 7 7 6 6 6 6 6 6 6 6 6 6 6 6 6 6 6 6 6 6 6 1 1 1 1 1 1 1 1 1 1 1 1 1 1 1 1 1 1 1 1 1 1 1
symmnumber: 1
zpe: 1005432.8 jmol-1
zpe.correction: 0.382949 hartree
zpe.thermalcorrener: 0.402367 hartree
zpe.thermalcorrenthalpy: 0.403311 hartree
zpe.thermalcorrgfe: 0.333638 hartree
zpe.sumelectzpe: -1298.419715 hartree
zpe.sumelectthermal: -1298.400297 hartree
zpe.sumelectthermalent: -1298.399353 hartree
zpe.sumelectthermalfe: -1298.469026 hartree
dipole: -1.4929 -0.7974 1.9117
dipole: 2.5533
quadrupole: -139.0243 -133.8034 -142.8794
quadrupole: -7.7216 -8.1452 -4.6428
quadrupole: -0.4552 4.7656 -4.3104 -7.7216 -8.1452 -4.6428
hfenergy: -1298.8026643 hartree
pointgroup: C01 [X(C19H23N3S1)]
dipole: -0.5271577 0.3346923 -0.7868773 debye
polarizability: 268.6770404|52.8113541|255.5021222|31.599444|-22.1184081|193.6994226 unknown
InChI: InChI=1S/C19H23N3S/c1-3-8-18-16(6-1)22(17-7-2-4-9-19(17)23-18)13-5-12-21-14-10-20-11-15-21/h1-4,6-9,20H,5,10-15H2
charge 0 multiplicity 1
46 atoms
S  1.920247 -1.268317 1.904593
N  -2.459668 1.39261 0.336318
N  -5.255889 0.773793 0.500817
N  0.852072 0.093692 -0.621306
C  -1.159847 2.028382 0.664423
C  -2.991284 0.539749 1.431792
C  -3.486714 2.362594 -0.121802
C  -0.316162 2.322594 -0.59773
C  -4.246908 -0.210786 0.952267
C  -4.747616 1.618854 -0.600576
C  -0.012205 1.027141 -1.38498
C  0.486233 -1.284575 -0.519506
C  2.172983 0.504914 -0.266568
C  0.95046 -2.075843 0.568972
C  2.842279 -0.087059 0.841406
C  -0.329418 -1.918446 -1.49712
C  2.86819 1.502841 -1.003842
C  0.623285 -3.441615 0.676868
C  4.159647 0.274969 1.182361
C  -0.692339 -3.276427 -1.36851
C  4.174261 1.895267 -0.639299
C  -0.218533 -4.047797 -0.284203
C  4.831139 1.281729 0.45025
H  -1.294708 2.972227 1.248426
H  -0.589367 1.330267 1.305167
H  -3.260138 1.145242 2.333044
H  -2.211049 -0.188599 1.719344
H  -3.076185 2.961935 -0.955415
H  -3.774383 3.064344 0.701369
H  -0.858008 3.012943 -1.274202
H  0.615282 2.836523 -0.296217
H  -3.93783 -0.916167 0.141648
H  -4.665687 -0.800938 1.787959
H  -5.524701 2.353343 -0.882498
H  -4.475424 1.027277 -1.510486
H  0.417086 1.25907 -2.382048
H  -0.984733 0.531502 -1.534721
H  -6.165057 0.344894 0.287759
H  -0.672655 -1.354058 -2.368776
H  2.389787 1.971708 -1.868589
H  1.013755 -4.02218 1.519618
H  4.649182 -0.21662 2.029868
H  -1.332283 -3.734372 -2.130826
H  4.680984 2.674746 -1.218998
H  -0.489963 -5.103936 -0.187988
H  5.847182 1.578284 0.729635
