program: Gaussian 09
title: 000151089
version: EM64L-G09RevD.01
frameworkgroup: C1[X(C21H28O4)]
method: RPBEPBE
basis: SDD
operation: Freq
keyword: #pfreq=noraman
keyword: PBEPBE/SDD
title: #p freq=noraman PBEPBE/SDD
converged: YES YES NO NO
title: Mulliken charges:
elementType: O O O O C C C C C C C C C C C C C C C C C C C C C H H H H H H H H H H H H H H H H H H H H H H H H H H H H
charge: -0.461051 -0.449721 -0.239559 -0.253588 -0.136256 -0.114138 -0.156753 0.251941 0.220968 -0.141670 -0.595947 -0.578543 -0.485380 0.327516 0.550181 -0.565312 -0.643965 -0.500807 -0.800889 -0.830107 -0.556507 -0.585387 -0.005884 0.173469 -0.172811 0.229117 0.231268 0.223163 0.216914 0.235119 0.238258 0.234378 0.224779 0.222106 0.223586 0.237485 0.235043 0.218186 0.237626 0.201381 0.289177 0.218181 0.227027 0.255225 0.236740 0.209805 0.253883 0.244939 0.230855 0.252229 0.343412 0.204640 0.375677
chargesum: 0.00000
title: Mulliken charges with hydrogens summed into heavy atoms:
elementType: O O O O C C C C C C C C C C C C C C C C C C C C C
charge: -0.117639 -0.074044 -0.239559 -0.253588 0.092861 0.117130 0.066410 0.251941 0.220968 0.075244 -0.122570 -0.119386 -0.039687 0.327516 0.550181 -0.092785 -0.188152 -0.010249 -0.100456 -0.129679 -0.080713 -0.333158 -0.005884 0.173469 0.031829
polarizability: 3.41569141e+02 9.32831739e+00 2.19604745e+02 -3.23281912e+00 -6.36232465e-01 1.67252138e+02
1716.lowfreq: -8.1704 -0.0004 0.0002 0.0005 0.8020 3.8270 24.2488 37.8713 45.6185
frequency: 24.1692 37.6559 45.6175 69.6531 87.3606 106.1753 129.1942 154.3251 175.2114 182.7092 188.3781 194.0335 208.7916 220.0229 229.2871 248.1575 251.7530 261.5879 266.6558 271.1143 292.7849 311.9084 319.4687 330.0786 348.5742 360.4333 377.7710 382.2006 412.2844 438.0918 452.8293 457.2237 465.7701 478.9158 500.1380 528.7310 545.8565 568.5193 581.3311 595.5180 613.6790 629.9631 646.1344 673.4110 696.0049 731.0604 768.8240 779.4283 823.2611 829.0558 839.9036 849.5273 879.2483 887.4757 900.7892 922.5780 930.9850 940.4972 947.2808 954.3048 958.9333 966.4301 979.6866 994.4593 1010.2504 1019.4155 1022.8233 1038.1564 1047.2114 1057.0599 1070.1630 1072.5949 1094.7061 1112.6946 1119.4771 1123.1595 1133.2988 1140.9257 1157.6388 1168.2602 1185.0031 1190.0142 1190.8710 1201.4036 1213.9789 1232.5901 1237.9883 1242.0279 1249.4167 1265.2791 1277.8248 1279.6147 1284.5956 1292.1847 1300.9174 1307.2426 1314.3902 1315.3144 1320.4982 1328.2768 1330.1305 1339.5327 1342.1150 1343.9005 1350.9854 1356.3575 1375.9989 1384.7333 1387.4493 1393.1079 1439.0123 1449.2131 1457.1904 1464.1388 1468.5358 1469.6479 1475.5424 1478.3941 1483.4662 1489.0852 1490.6154 1545.1142 1582.6445 1620.9324 1670.4101 2915.7687 2945.4677 2949.0509 2954.0197 2965.8146 2973.5782 2974.5871 2977.6612 2982.1670 2985.8577 2987.6799 2988.9036 2991.7674 3004.5770 3036.3974 3042.2391 3044.9134 3048.5756 3057.6527 3071.6709 3074.4349 3081.0867 3085.2460 3087.3828 3100.3758 3114.3852 3366.4914 3542.1402
redmass: 7.7446 3.6400 5.0849 7.3229 6.6793 3.2147 3.6344 4.8796 3.3169 2.3385 3.7402 1.3681 2.7743 2.3622 2.8234 1.7483 3.0124 2.8550 1.8303 2.5590 2.5926 1.3591 2.9720 3.0766 3.0761 4.3761 2.6527 5.2343 3.4845 2.9601 3.1521 3.1657 3.7178 3.1022 3.8692 2.6641 3.6389 2.5290 3.1313 2.3115 1.2258 3.3457 3.7740 3.4411 3.5672 2.9824 2.8357 2.6785 2.3358 2.1971 2.6717 1.8919 1.5961 2.0927 2.2918 1.8412 2.0154 1.7718 1.8215 3.0431 2.3997 2.2278 2.4656 2.2857 2.1861 1.9412 1.9449 2.1332 2.4583 2.3705 2.3018 2.5313 1.8712 1.8067 2.5782 1.7755 1.7556 1.8119 1.7226 1.9843 1.8169 1.8870 1.9427 1.4932 1.9203 1.7669 1.6173 1.5042 1.4766 1.4945 1.4632 1.8600 1.3963 1.3961 1.3660 1.7109 1.4430 1.4730 1.4352 1.5166 1.4883 1.3351 1.8941 1.5866 1.4763 1.3679 1.3834 1.2500 1.1857 1.4145 1.0787 1.0817 1.0890 1.0837 1.0892 1.0766 1.0738 1.0570 1.0612 1.0539 1.0765 6.5178 10.0443 7.6332 7.7558 1.0804 1.0794 1.0664 1.0818 1.0776 1.0652 1.0667 1.0654 1.0375 1.0595 1.0395 1.0653 1.0870 1.0638 1.0988 1.0963 1.0960 1.1024 1.0943 1.0983 1.1020 1.0992 1.1000 1.0998 1.0927 1.0910 1.0633 1.0657
irintensity: 2.1986 2.1763 1.2110 0.0948 2.8683 1.8468 0.0268 1.6415 0.5630 1.6228 0.5998 0.1971 1.8779 2.6345 0.3382 0.4547 5.2266 2.9605 1.1029 1.2687 18.1940 95.7394 29.5997 5.0279 1.7284 10.6259 4.6430 0.6867 5.2596 1.7539 2.7177 6.6274 3.4748 4.4825 3.3669 0.1726 0.5804 5.5569 5.8888 31.8097 100.2386 11.0877 0.4810 7.7640 1.3148 1.0516 2.7969 6.3363 21.4728 14.2054 6.7116 3.4873 22.0437 7.4345 14.6887 8.3774 13.1838 5.0481 15.0492 45.1538 27.7640 24.3018 11.6278 13.3583 6.2696 15.5801 1.7677 24.7231 3.9124 4.1678 9.3741 8.2188 12.4147 1.2916 9.3590 1.5804 4.9529 8.2742 11.1342 6.1762 35.3597 20.7248 38.6918 34.1858 3.9518 18.8770 5.2510 70.5521 44.4381 6.1384 4.1275 50.0333 3.8260 12.9980 8.3028 13.5797 113.5089 11.4322 51.5097 15.8544 17.3974 4.9142 6.9414 23.3286 5.1588 2.2594 0.6621 12.0207 27.1225 8.4463 19.2010 6.2108 20.1235 5.6791 7.1349 7.2247 6.6010 4.2058 12.1991 10.4970 5.2431 377.9201 158.9103 184.5956 43.3265 10.9920 2.0345 15.6784 0.8082 18.8013 41.3803 9.0417 6.0770 27.1915 24.5567 17.9769 68.3871 49.1142 30.6046 45.5903 35.2313 24.7442 23.3085 25.2822 31.7503 37.4138 47.3507 20.8137 13.3522 9.9471 12.8910 80.6680 7.2787
temp: 298.150 k
press: 1.00000 atm
elementType: 8 8 8 8 6 6 6 6 6 6 6 6 6 6 6 6 6 6 6 6 6 6 6 6 6 1 1 1 1 1 1 1 1 1 1 1 1 1 1 1 1 1 1 1 1 1 1 1 1 1 1 1 1
symmnumber: 1
zpe: 1174724.6 jmol-1
zpe.correction: 0.447429 hartree
zpe.thermalcorrener: 0.471085 hartree
zpe.thermalcorrenthalpy: 0.472029 hartree
zpe.thermalcorrgfe: 0.395969 hartree
zpe.sumelectzpe: -1115.997177 hartree
zpe.sumelectthermal: -1115.973521 hartree
zpe.sumelectthermalent: -1115.972577 hartree
zpe.sumelectthermalfe: -1116.048637 hartree
dipole: -4.4515 2.5915 2.6543
dipole: 5.7946
quadrupole: -220.6646 -138.9236 -149.6612
quadrupole: -8.5577 9.7457 -3.2129
quadrupole: -50.9148 30.8262 20.0886 -8.5577 9.7457 -3.2129
hfenergy: -1116.4446061 hartree
pointgroup: C01 [X(C21H28O4)]
dipole: 1.7576823 -1.056757 0.9955661 debye
polarizability: 341.2799419|10.5538417|219.5948348|4.8355791|3.7351704|167.5512472 unknown
InChI: InChI=1S/C21H28O4/c1-20-8-7-13(23)9-12(20)3-4-14-15-5-6-16(18(25)11-22)21(15,2)10-17(24)19(14)20/h9,11,14-15,17,19,24-25H,3-8,10H2,1-2H3
charge 0 multiplicity 1
53 atoms
O  -0.599029 2.713423 0.128153
O  4.448315 1.811523 0.326978
O  -6.491026 0.087784 -1.128028
O  6.785479 0.989373 -0.715924
C  -0.260462 -1.116802 0.382241
C  1.179183 -1.123191 -0.168698
C  -0.930705 0.25679 0.002329
C  2.076824 -0.014608 0.467805
C  -2.468825 0.35692 0.402171
C  -0.041664 1.411472 0.558884
C  1.438886 1.344524 0.097302
C  2.06514 -2.386386 -0.110662
C  -1.081035 -2.308579 -0.147348
C  3.445214 -0.353159 -0.121732
C  -3.204771 -0.968745 0.101733
C  3.452169 -1.825898 -0.562389
C  -2.50794 -2.2714 0.437337
C  -3.144932 1.492656 -0.435195
C  2.241459 -0.140127 2.020908
C  -2.62217 0.649311 1.930652
C  -4.680991 1.529535 -0.310706
C  -4.480881 -1.003547 -0.4043
C  4.523426 0.496012 -0.164503
C  -5.31109 0.188679 -0.667767
C  5.839673 0.136245 -0.709561
H  -0.227908 -1.209996 1.489236
H  1.096508 -0.861411 -1.249616
H  -0.891882 0.329828 -1.107543
H  -0.067962 1.373647 1.668612
H  1.470216 1.489381 -1.00046
H  2.005981 2.177678 0.555021
H  1.718609 -3.194274 -0.777422
H  2.118205 -2.79705 0.914877
H  -0.587756 -3.258451 0.133593
H  -1.126313 -2.277639 -1.255272
H  3.529843 -1.897198 -1.66594
H  4.297718 -2.4003 -0.143244
H  -2.430946 -2.374324 1.54151
H  -3.10969 -3.125987 0.079005
H  -2.881834 1.336091 -1.501012
H  -2.7094 2.460025 -0.145475
H  1.28003 -0.041589 2.554109
H  2.688558 -1.107262 2.310762
H  2.913477 0.662052 2.372812
H  -3.681061 0.594388 2.238221
H  -2.061694 -0.076294 2.548806
H  -2.253203 1.663768 2.161434
H  -5.117249 2.310578 -0.958807
H  -4.985168 1.781582 0.726388
H  -4.96844 -1.968031 -0.600542
H  0.061239 3.418106 0.353768
H  5.977712 -0.885911 -1.116085
H  5.351258 2.219183 0.169084
