program: Gaussian 09
title: 000151087
version: EM64L-G09RevD.01
frameworkgroup: C1[X(C8H16N2O4S)]
method: RPBEPBE
basis: SDD
operation: Freq
keyword: #p
keyword: freq=noraman
keyword: PBEPBE/SDD
title: #p freq=noraman PBEPBE/SDD
converged: YES YES NO NO
title: Mulliken charges:
elementType: S O O O O N N C C C C C C C C H H H H H H H H H H H H H H H H
charge: 0.170139 -0.292641 -0.432861 -0.493812 -0.216989 -0.408600 -0.640717 -0.135358 -0.363236 -0.178265 -0.681038 0.169397 0.128658 -0.321372 -0.842287 0.300694 0.263105 0.250755 0.404253 0.247520 0.264048 0.258040 0.222850 0.218158 0.324523 0.271604 0.386401 0.254410 0.254486 0.254650 0.363488
chargesum: 0.00000
title: Mulliken charges with hydrogens summed into heavy atoms:
elementType: S O O O O N N C C C C C C C C
charge: 0.170139 -0.292641 -0.046460 -0.130324 -0.216989 -0.004347 -0.044590 0.165336 0.150624 0.069255 -0.158950 0.169397 0.128658 0.119635 -0.078742
polarizability: 1.44784675e+02 -2.61613522e+00 1.23111226e+02 -1.95607323e+00 4.43477758e+00 1.24949808e+02
1716.lowfreq: -10.5292 -2.3749 -0.0007 0.0012 0.0017 11.0574 19.7174 24.4050 35.4501
frequency: 19.4674 24.3458 35.4274 40.3016 69.7864 77.2988 87.0331 92.3325 129.7909 154.0133 161.0354 193.1108 213.1662 224.6614 259.5612 280.1474 292.2021 321.6375 327.1570 347.9633 372.5064 458.0366 487.2205 531.3773 567.2023 587.7219 629.9730 664.8643 685.3214 691.9187 719.3077 755.1258 775.8287 811.7668 828.4973 893.5167 909.8030 939.0954 962.5581 978.5080 985.4587 997.8578 1018.9734 1067.8716 1075.4693 1110.1109 1128.4101 1167.9439 1170.6996 1194.4038 1204.4921 1222.3660 1245.9431 1267.2564 1278.4909 1293.3240 1309.5151 1329.6461 1344.0038 1353.6941 1357.3665 1386.4658 1448.9404 1452.6477 1461.5574 1465.3415 1466.9748 1516.8092 1586.5844 1647.9183 1668.6506 2916.0340 2984.2628 2996.1674 2998.6147 2999.8502 3018.6603 3054.1579 3062.5588 3088.7722 3110.2101 3128.1190 3329.0053 3441.0605 3516.0005 3599.8770 3605.1165
redmass: 5.4281 3.5894 5.9108 9.1301 5.0081 5.6856 4.9302 2.1937 3.6270 1.1636 2.7718 5.4363 3.2948 5.2950 1.2339 3.6555 1.8505 2.2522 3.8703 3.1469 4.2965 5.5052 3.8901 3.8126 3.9600 3.0317 1.7737 5.7054 1.4464 3.4540 3.7393 2.9421 1.4866 3.3342 1.1688 3.3693 2.6485 6.5867 1.2624 1.3628 1.7572 1.6156 2.1167 3.0482 1.6326 3.0264 1.6208 1.2789 1.2180 1.6453 1.5020 1.2764 2.0053 1.2654 1.3179 1.3738 1.2729 1.8009 1.1890 1.6207 1.3266 1.4781 1.0534 1.0894 1.0559 1.0919 1.0880 1.9073 2.7057 1.4257 8.6124 1.0813 1.0561 1.0531 1.0684 1.0434 1.0611 1.1103 1.1054 1.1063 1.1057 1.1022 1.0818 1.0496 1.0641 1.0939 1.0668
irintensity: 1.7617 1.9814 1.4515 1.4780 0.5570 5.4099 2.8740 0.1983 2.9464 0.0995 8.8067 1.0422 2.2734 1.4802 7.7662 3.2461 116.6943 84.9906 10.5783 6.0839 8.5679 26.0097 9.6646 49.6966 14.6084 51.4993 55.1555 9.7590 343.3038 1.9536 6.8199 1.7533 8.6014 4.6562 121.6925 25.5807 31.1654 47.1843 24.8054 14.6046 8.0751 33.5342 19.8128 20.2363 127.3463 20.7001 18.9179 26.4250 1.3369 8.2104 38.3550 2.6914 25.6749 11.7693 7.7269 9.8639 3.5189 17.6664 1.1141 7.9310 2.8169 3.5007 16.1548 11.2600 9.2582 12.0555 19.1383 398.9632 236.1556 34.3370 202.0759 33.1555 57.0142 27.2194 20.8925 25.3230 11.6779 46.8850 7.3382 27.3352 22.0032 11.8333 252.6807 32.9530 29.3425 17.1635 8.9574
temp: 298.150 k
press: 1.00000 atm
elementType: 16 8 8 8 8 7 7 6 6 6 6 6 6 6 6 1 1 1 1 1 1 1 1 1 1 1 1 1 1 1 1
symmnumber: 1
zpe: 650016.3 jmol-1
zpe.correction: 0.247578 hartree
zpe.thermalcorrener: 0.266068 hartree
zpe.thermalcorrenthalpy: 0.267012 hartree
zpe.thermalcorrgfe: 0.197759 hartree
zpe.sumelectzpe: -1121.707133 hartree
zpe.sumelectthermal: -1121.688643 hartree
zpe.sumelectthermalent: -1121.687699 hartree
zpe.sumelectthermalfe: -1121.756952 hartree
dipole: 1.9230 0.6955 5.9602
dipole: 6.3013
quadrupole: -97.3899 -93.0924 -96.7352
quadrupole: 2.8752 1.9850 4.9777
quadrupole: -1.6507 2.6468 -0.9961 2.8752 1.9850 4.9777
hfenergy: -1121.9547109 hartree
pointgroup: C01 [X(C8H16N2O4S1)]
dipole: 0.7515175 0.628143 2.2774227 debye
polarizability: 144.6826185|-3.3286274|124.6740791|-1.2607619|4.5025141|123.489011 unknown
InChI: InChI=1S/C8H16N2O4S/c1-15-3-2-6(8(13)14)10-7(12)5(9)4-11/h5-6,10-11,13H,2-4,9H2,1H3
charge 0 multiplicity 1
31 atoms
S  -3.858662 -1.60927 -0.079646
O  1.450791 -1.344467 -1.867255
O  -0.167909 2.437513 0.584346
O  2.11551 0.17334 2.108681
O  -1.49956 2.80908 -1.280115
N  0.630161 0.028699 -0.175462
N  3.539933 -2.22825 -0.375568
C  -0.380816 0.629424 -1.049625
C  -1.678705 -0.237364 -1.167629
C  2.502192 -1.503322 0.361945
C  -2.399529 -0.428533 0.175426
C  1.48466 -0.930661 -0.6623
C  -0.745135 2.050569 -0.637494
C  3.163506 -0.403466 1.226416
C  -4.473383 -1.678722 1.697459
H  0.041921 0.683955 -2.072963
H  -1.37244 -1.214891 -1.581311
H  -2.351553 0.247388 -1.898231
H  0.794602 0.376296 0.785804
H  1.920711 -2.152715 1.057094
H  -1.725298 -0.874916 0.927427
H  -2.798057 0.527272 0.561909
H  3.609645 0.370659 0.571321
H  3.961448 -0.868419 1.835387
H  3.295511 -2.331458 -1.368893
H  3.862226 -3.093152 0.061187
H  -0.460736 3.364295 0.800335
H  -3.687928 -2.076422 2.360559
H  -5.339616 -2.358593 1.704928
H  -4.788863 -0.678366 2.03559
H  2.483072 0.927898 2.629079
