program: Gaussian 09
title: 000151086
version: EM64L-G09RevD.01
frameworkgroup: C1[X(C17H17NO2)]
method: RPBEPBE
basis: SDD
operation: Freq
keyword: #p
keyword: freq=noraman
keyword: PBEPBE/SDD
title: #p freq=noraman PBEPBE/SDD
converged: YES YES NO NO
title: Mulliken charges:
elementType: O O N C C C C C C C C C C C C C C C C C H H H H H H H H H H H H H H H H H
charge: -0.456118 -0.502857 -0.110905 -0.144654 0.059540 -0.672095 0.429155 -0.400066 -0.547280 0.135568 0.375719 0.147805 -0.613501 -0.641942 -0.040015 0.176296 -0.457162 -0.354972 -0.243030 -0.267003 0.203835 0.220659 0.245653 0.212800 0.191959 0.234633 0.205452 0.230927 0.229695 0.188763 0.224271 0.233618 0.290039 0.223662 0.224197 0.391986 0.375370
chargesum: 0.00000
title: Mulliken charges with hydrogens summed into heavy atoms:
elementType: O O N C C C C C C C C C C C C C C C C C
charge: -0.064132 -0.127487 -0.110905 0.059180 0.059540 -0.205783 0.429155 0.004694 -0.107196 0.135568 0.375719 0.147805 -0.382574 0.000787 -0.040015 0.176296 -0.223544 -0.064933 -0.019368 -0.042806
polarizability: 2.62550718e+02 1.72769883e+01 2.35381886e+02 -6.83030723e+00 5.84368226e+00 1.02649506e+02
1716.lowfreq: -9.9909 -8.7474 -0.0004 0.0002 0.0004 2.3667 46.5074 74.4499 82.6689
frequency: 46.4825 74.4418 82.6645 120.4164 156.3563 180.6444 199.2219 226.3482 237.1527 244.9038 259.4199 279.4629 322.6597 327.6334 332.1298 347.9575 379.6190 385.1696 414.8538 443.4366 453.7002 469.9790 503.7546 516.8194 532.7860 537.4556 585.5744 601.8782 639.5533 649.2197 663.6233 714.3240 736.4451 746.0122 777.6207 783.4535 811.6172 820.4042 840.3483 870.9061 886.9994 948.8795 951.9990 957.0988 983.1100 989.9592 1032.7507 1042.8702 1052.7044 1073.5722 1078.0192 1093.1521 1110.2414 1118.6075 1147.4183 1153.9214 1162.4907 1177.2248 1191.4631 1205.7096 1224.5570 1228.3902 1238.1500 1254.3205 1280.9636 1291.9309 1303.0961 1307.0898 1321.2735 1335.4020 1349.0135 1373.3206 1378.6764 1404.5888 1428.5086 1433.4886 1445.6661 1451.9907 1457.2818 1467.0059 1473.1988 1477.8733 1482.1626 1505.9274 1579.8239 1608.5183 1611.9368 1620.2199 2776.9852 2842.9144 2861.1449 2974.7409 2978.6458 3027.9780 3033.0835 3035.0021 3059.8293 3089.8300 3111.9499 3115.3433 3131.1097 3153.8891 3195.4881 3488.6718 3631.6438
redmass: 3.5320 3.7189 5.0179 4.3300 2.7569 1.9491 2.0608 2.9139 3.6120 1.1415 3.4015 2.4844 4.9146 4.6246 4.1317 4.7047 4.1685 6.0781 3.7798 3.0596 3.4389 3.5857 2.9577 1.1500 3.9055 3.7470 4.2435 4.7038 6.1452 5.4806 4.2700 3.2508 4.2661 1.7284 4.5568 2.3931 3.6236 1.9800 2.0325 2.0022 2.2226 2.1491 2.1139 2.0362 2.1115 1.3293 2.0757 2.6471 2.8327 1.9562 2.3973 2.6547 1.4130 1.7357 1.5805 1.9064 1.2984 1.1165 1.4152 1.8748 2.0061 1.8210 2.4920 1.4316 1.8850 1.6616 1.8594 1.5684 1.6887 1.8526 1.9406 1.7412 3.3150 4.6256 2.1132 1.3325 1.2742 1.3508 1.9437 1.1246 2.2929 1.1102 1.0567 3.2367 6.4722 7.1785 7.0020 7.3279 1.0780 1.0687 1.0593 1.0599 1.0642 1.0975 1.0872 1.0774 1.0961 1.0993 1.0915 1.0865 1.0902 1.0984 1.0940 1.0644 1.0667
irintensity: 0.4543 0.2220 4.0062 0.3789 0.9711 4.4383 2.5623 14.0821 6.4099 146.3490 7.0544 0.7054 5.3766 3.7503 3.6279 2.8553 0.6410 1.2463 2.8600 1.2120 1.8780 1.4005 4.3947 114.3877 3.3492 16.8598 0.1803 8.7760 18.2257 10.1436 7.0247 0.7506 2.0837 37.7306 3.7225 43.2816 23.1033 21.8498 16.4111 27.4866 23.3800 10.5687 20.7161 12.9504 18.8661 0.1066 3.8815 11.3285 42.9209 49.4711 1.7112 9.7827 6.5020 126.3547 8.9247 14.0573 0.4291 2.8387 0.8382 6.3456 5.7777 18.7995 115.9866 4.2560 50.2672 140.0475 34.5720 19.9113 1.6082 25.9765 2.1661 11.9761 4.5719 19.4274 32.7621 0.6983 6.5547 11.2493 7.0083 8.3773 32.5449 12.0536 24.3642 41.0606 2.4238 10.7721 0.5118 11.9937 48.9243 55.7943 180.1094 37.1808 19.9902 40.0929 11.8572 82.1453 37.1741 31.5250 15.6888 6.0968 21.1227 44.1340 6.5201 101.9574 61.5922
temp: 298.150 k
press: 1.00000 atm
elementType: 8 8 7 6 6 6 6 6 6 6 6 6 6 6 6 6 6 6 6 6 1 1 1 1 1 1 1 1 1 1 1 1 1 1 1 1 1
symmnumber: 1
zpe: 786647.9 jmol-1
zpe.correction: 0.299618 hartree
zpe.thermalcorrener: 0.316153 hartree
zpe.thermalcorrenthalpy: 0.317097 hartree
zpe.thermalcorrgfe: 0.256842 hartree
zpe.sumelectzpe: -861.780257 hartree
zpe.sumelectthermal: -861.763722 hartree
zpe.sumelectthermalent: -861.762778 hartree
zpe.sumelectthermalfe: -861.823033 hartree
dipole: 3.2774 0.7870 0.4878
dipole: 3.4056
quadrupole: -105.6308 -96.0170 -122.4849
quadrupole: 8.7113 0.2884 -1.0785
quadrupole: 2.4135 12.0272 -14.4407 8.7113 0.2884 -1.0785
hfenergy: -862.0798749 hartree
pointgroup: C01 [X(C17H17N1O2)]
dipole: -1.3201845 -0.1284419 0.1894526 debye
polarizability: 266.759107|12.860584|231.2097465|6.2479317|-6.1771344|102.613257 unknown
InChI: InChI=1S/C17H17NO2/c1-18-7-6-11-9-14(19)17(20)16-12-5-3-2-4-10(12)8-13(18)15(11)16/h2-5,9,13,19-20H,6-8H2,1H3
charge 0 multiplicity 1
37 atoms
O  0.982095 -3.114235 -0.063175
O  -1.464505 -4.058952 -0.178115
N  -1.839789 2.457883 -0.133283
C  -0.643056 1.625526 0.167401
C  -0.925795 0.120185 0.055165
C  0.54458 1.960808 -0.762754
C  -2.248325 -0.374658 -0.014591
C  -3.043333 1.94361 0.564862
C  -3.432108 0.578668 -0.01692
C  0.2066 -0.768358 0.042057
C  1.761172 1.158439 -0.338605
C  1.583009 -0.200034 0.073239
C  -2.475061 -1.772379 -0.091684
C  -1.621569 3.890159 0.162629
C  -0.049909 -2.162747 -0.029428
C  -1.382203 -2.644488 -0.099472
C  3.050978 1.732357 -0.338579
C  2.725921 -0.939915 0.48682
C  4.180016 0.985194 0.06629
C  4.009022 -0.35341 0.485173
H  -0.303355 1.82389 1.22356
H  0.784268 3.037233 -0.732031
H  0.244117 1.716409 -1.801903
H  -3.866449 2.666166 0.415123
H  -2.874036 1.853434 1.669589
H  -3.78862 0.729771 -1.054905
H  -4.273117 0.147555 0.560541
H  -3.501996 -2.157231 -0.14283
H  -0.834954 4.310943 -0.484908
H  -1.332403 4.079221 1.228065
H  -2.552409 4.446655 -0.044309
H  3.170407 2.775469 -0.656589
H  2.604897 -1.978302 0.798314
H  5.175649 1.443144 0.06163
H  4.873683 -0.943453 0.809364
H  0.563146 -4.01017 -0.175657
H  -2.396569 -4.37029 -0.258183
