program: Gaussian 09
title: 000151084
version: EM64L-G09RevD.01
frameworkgroup: C1[X(C20H28O3)]
method: RPBEPBE
basis: SDD
operation: Freq
keyword: #pfreq=noraman
keyword: PBEPBE/SDD
title: #p freq=noraman PBEPBE/SDD
converged: NO YES NO NO
title: Mulliken charges:
elementType: O O O C C C C C C C C C C C C C C C C C C C C H H H H H H H H H H H H H H H H H H H H H H H H H H H H
charge: -0.241079 -0.235502 -0.230457 -0.125347 0.378841 -0.152959 -0.095631 0.229410 -0.528647 -0.536550 -0.140836 -0.550719 -0.479070 -0.455810 0.540175 -0.640677 -0.814521 -0.492819 -0.810236 -0.563068 -0.585568 0.178109 -0.003646 0.216401 0.235359 0.203014 0.200808 0.222000 0.218204 0.227544 0.267950 0.218414 0.228724 0.227438 0.218046 0.227043 0.239640 0.222263 0.236186 0.228422 0.244291 0.219568 0.218688 0.215484 0.220601 0.227689 0.235234 0.245916 0.231515 0.255302 0.204863
chargesum: 0.00000
title: Mulliken charges with hydrogens summed into heavy atoms:
elementType: O O O C C C C C C C C C C C C C C C C C C C C
charge: -0.241079 -0.235502 -0.230457 0.091054 0.378841 0.082400 0.107384 0.229410 -0.105839 -0.090802 0.127114 -0.103581 -0.033585 0.010872 0.540175 -0.182227 -0.122239 -0.058647 -0.126712 -0.085638 -0.330267 0.178109 0.201217
polarizability: 2.89132960e+02 -2.25468928e+00 1.93166327e+02 -1.16176651e+01 -2.54537206e+00 1.70221355e+02
1716.lowfreq: -13.0003 -7.9294 -0.0009 -0.0008 -0.0002 2.5492 25.8727 36.4462 43.8329
frequency: 25.7421 36.2920 43.5885 64.3982 102.0743 108.2440 142.2957 151.9980 167.5357 176.6244 186.0926 203.2495 219.4736 227.2349 241.7444 251.5712 260.4628 271.6602 291.7022 308.9854 314.6423 356.2850 368.4218 390.6892 398.1168 424.7713 449.2913 456.6533 479.5401 493.8037 525.6316 528.0010 537.4468 552.5675 587.9385 618.2142 642.9796 672.3120 696.3133 735.5075 764.7037 774.4169 802.6847 823.0972 829.4050 840.4655 856.2216 881.5450 896.0077 912.8790 923.3230 932.8722 946.2025 953.1405 959.9663 961.0558 969.9770 995.1991 1003.1769 1023.3492 1027.5981 1030.0505 1042.2034 1048.5362 1074.6545 1078.8956 1092.2483 1094.5720 1113.9193 1116.0726 1122.8792 1128.1622 1135.0740 1161.1730 1178.9712 1187.6347 1188.3804 1203.9699 1211.1342 1212.1712 1230.4086 1238.3701 1246.3940 1258.9416 1269.5182 1279.0109 1279.5098 1286.0477 1290.8247 1302.4851 1317.6290 1322.4483 1323.6287 1331.4950 1332.1716 1337.2313 1344.0739 1344.8146 1348.2450 1352.1921 1353.3008 1367.6602 1386.7110 1394.7487 1443.6243 1455.2231 1459.2472 1464.8261 1467.1325 1468.4490 1472.4245 1477.4226 1480.1443 1486.1977 1490.9787 1491.6285 1584.2855 1617.6662 1622.8396 2907.6812 2915.2990 2951.0706 2959.0772 2961.2912 2971.1605 2973.9816 2980.6399 2984.2836 2989.5989 2994.6080 2997.6573 3012.7837 3021.2456 3026.2892 3031.8618 3034.4841 3038.4698 3040.3864 3047.3629 3056.1541 3062.5304 3077.2177 3082.0271 3085.3476 3090.8278 3092.7855 3117.0629
redmass: 8.5294 6.6198 3.4081 5.1281 2.4912 4.6642 1.9001 4.3861 2.3489 2.1197 1.7572 1.4285 2.8481 2.8617 3.2022 2.3181 2.7943 2.3964 2.5397 2.8275 3.0764 2.2597 3.2251 2.8602 3.3022 3.5817 3.3371 3.6296 2.7527 3.5314 2.7178 3.2324 2.8986 2.5342 2.9101 3.7700 3.6118 3.3815 2.8221 2.8881 3.0809 2.1564 2.1841 2.2194 2.0534 2.0279 2.2048 1.5685 1.7715 1.9668 1.8248 1.9130 2.2602 2.4376 2.0285 1.6825 2.2406 2.1627 1.9176 2.0514 1.9259 1.8436 2.1763 2.2399 2.3766 2.5759 1.6334 8.7074 2.3993 2.1395 1.9196 1.5469 1.8719 2.2971 1.3852 1.7734 1.8739 1.9304 1.2860 1.6099 1.4087 1.5926 1.4153 1.4628 1.5426 2.0057 1.4053 1.4588 1.4030 1.4596 1.4688 1.4988 1.3927 1.3588 1.3034 1.3799 2.0019 1.3504 1.3913 1.3966 1.4923 1.4763 1.2109 1.2084 1.0782 1.0855 1.0739 1.0855 1.0812 1.0877 1.0768 1.0571 1.0785 1.0576 1.0734 1.0677 10.0444 8.8535 7.7365 1.0814 1.0802 1.0662 1.0632 1.0734 1.0689 1.0640 1.0625 1.0428 1.0539 1.0552 1.0453 1.0856 1.0634 1.0960 1.0913 1.0973 1.0995 1.0980 1.1003 1.1016 1.0958 1.0990 1.0990 1.0995 1.1019 1.0991 1.0911
irintensity: 2.4029 1.6323 0.9880 1.3297 0.6826 0.6134 0.5566 2.1331 3.4197 0.5294 2.4936 0.0669 0.1242 1.5021 4.8985 3.9499 0.3772 1.1470 2.4785 4.7531 3.3850 0.4295 4.0168 0.4084 5.8442 1.0872 3.2745 5.4466 1.4588 3.6633 0.3413 0.3029 1.7675 1.9371 1.3266 1.6852 0.2623 7.6050 4.7340 0.6412 1.9938 7.0369 0.3470 1.1922 5.3506 4.4268 12.6008 15.7059 5.5305 6.7859 3.5247 35.7665 5.4790 4.3068 9.1422 2.8259 2.8491 8.9861 7.4349 6.6147 3.8040 2.3731 22.5827 8.1776 11.8606 4.3618 7.9730 383.2172 1.5792 5.0972 2.6783 1.6176 9.3067 0.5769 10.6518 1.6387 24.2333 1.5111 5.0498 2.5966 23.8728 13.6506 1.2860 1.1448 2.5274 38.7266 0.6953 0.6145 0.2832 3.5019 0.2603 12.9737 5.7709 1.9648 3.8993 7.8777 7.1298 0.7597 1.1370 3.4035 1.3011 1.7880 15.0732 32.0359 17.7533 20.5117 2.3369 12.0639 7.6801 7.3123 7.8879 5.5173 2.6920 1.1327 14.9397 11.8188 163.8419 328.1090 181.6057 4.2001 20.5531 15.5056 32.7652 11.7957 34.7807 32.9684 22.9185 14.4021 18.0715 22.2003 34.6192 8.2854 31.5661 25.6443 67.8637 44.2820 28.2224 65.4547 35.6334 16.7941 22.3837 39.5893 22.7103 45.0099 20.8866 27.7876 10.8053
temp: 298.150 k
press: 1.00000 atm
elementType: 8 8 8 6 6 6 6 6 6 6 6 6 6 6 6 6 6 6 6 6 6 6 6 1 1 1 1 1 1 1 1 1 1 1 1 1 1 1 1 1 1 1 1 1 1 1 1 1 1 1 1
symmnumber: 1
zpe: 1152788.7 jmol-1
zpe.correction: 0.439074 hartree
zpe.thermalcorrener: 0.460716 hartree
zpe.thermalcorrenthalpy: 0.461660 hartree
zpe.thermalcorrgfe: 0.389224 hartree
zpe.sumelectzpe: -1002.835030 hartree
zpe.sumelectthermal: -1002.813389 hartree
zpe.sumelectthermalent: -1002.812445 hartree
zpe.sumelectthermalfe: -1002.884881 hartree
dipole: -2.9158 0.1729 3.6486
dipole: 4.6737
quadrupole: -193.3977 -130.2797 -144.4034
quadrupole: 0.4954 2.0630 -0.3063
quadrupole: -37.3708 25.7472 11.6235 0.4954 2.0630 -0.3063
hfenergy: -1003.2741044 hartree
pointgroup: C01 [X(C20H28O3)]
dipole: -1.1578706 -0.0648058 1.4269822 debye
polarizability: 289.3232038|-0.4931244|193.4193241|-10.8310327|-0.6345685|169.7781137 unknown
InChI: InChI=1S/C20H28O3/c1-19-9-7-14(22)11-13(19)3-4-15-16-5-6-18(23-12-21)20(16,2)10-8-17(15)19/h11-12,15-18H,3-10H2,1-2H3
charge 0 multiplicity 1
51 atoms
O  -4.694672 -0.934672 0.115505
O  6.201306 -0.055552 -1.277288
O  -6.018311 -0.438484 -1.757656
C  -1.442113 0.861449 -0.098949
C  -2.244657 -0.425627 0.275369
C  -0.005076 0.866192 0.461395
C  0.752106 -0.387173 -0.088907
C  2.259396 -0.47773 0.397442
C  -1.513541 -1.641262 -0.338011
C  -0.039412 -1.707516 0.147112
C  -3.593853 -0.052195 -0.387174
C  -2.404479 2.029786 0.252535
C  0.747998 2.15548 0.067886
C  -3.831774 1.447683 -0.037429
C  2.950922 0.872672 0.131054
C  2.213051 2.125988 0.564672
C  -2.438004 -0.608823 1.804209
C  2.974255 -1.606393 -0.410665
C  2.358552 -0.7780 1.927866
C  4.513606 -1.559259 -0.328755
C  4.200782 0.967048 -0.42884
C  5.057733 -0.19343 -0.743064
C  -5.828021 -1.027243 -0.674218
H  -1.340115 0.850571 -1.209814
H  -0.051867 0.817881 1.570177
H  0.804808 -0.237776 -1.193383
H  -1.531595 -1.555555 -1.445088
H  -2.030961 -2.585265 -0.078066
H  -0.026223 -1.968133 1.222213
H  0.463557 -2.539237 -0.379717
H  -3.544358 -0.191077 -1.484293
H  -2.199098 2.931663 -0.349607
H  -2.302078 2.317527 1.315855
H  0.235884 3.042208 0.487253
H  0.733977 2.263797 -1.036438
H  -4.483772 1.519649 0.851738
H  -4.343466 1.967363 -0.864111
H  2.201487 2.165119 1.675392
H  2.761337 3.023089 0.223946
H  -2.922489 0.26707 2.270098
H  -3.084333 -1.482768 1.994128
H  -1.478126 -0.774102 2.32098
H  2.675738 -1.517443 -1.475245
H  2.622237 -2.593598 -0.058877
H  1.810816 -0.034709 2.533309
H  1.946646 -1.775899 2.160845
H  3.411538 -0.7636 2.26122
H  4.97742 -2.333661 -0.9650
H  4.855105 -1.756806 0.708012
H  4.646932 1.950813 -0.626609
H  -6.540893 -1.717359 -0.183509
