program: Gaussian 09
title: 000151083
version: EM64L-G09RevD.01
frameworkgroup: C1[X(C7H4INS)]
method: RPBEPBE
basis: SDD
operation: Freq
keyword: #p
keyword: freq=noraman
keyword: PBEPBE/SDD
title: #p freq=noraman PBEPBE/SDD
converged: NO YES NO NO
title: Mulliken charges:
elementType: I S N C C C C C C C H H H H
charge: 0.120972 0.150023 0.304168 0.498078 -0.316497 -0.383881 -0.280981 -0.168317 -0.194613 -0.768327 0.276786 0.261473 0.243808 0.257309
chargesum: 0.00000
title: Mulliken charges with hydrogens summed into heavy atoms:
elementType: I S N C C C C C C C
charge: 0.120972 0.150023 0.304168 0.498078 -0.039711 -0.122408 -0.280981 0.075490 0.062696 -0.768327
polarizability: 2.41153695e+02 -2.27198334e+01 1.22783519e+02 2.43359172e-02 -3.25372383e-03 3.84638974e+01
1716.lowfreq: -8.5207 -7.1915 -0.0008 0.0013 0.0018 4.3243 19.7267 66.6555 148.0319
frequency: 19.4547 66.6434 148.0270 166.2336 243.6414 248.1378 360.5993 384.2148 418.2368 437.4911 449.3342 559.4660 638.6610 680.6591 689.0795 788.5376 889.7679 908.2133 923.5106 975.8635 980.5548 1058.8844 1093.7567 1178.8591 1258.0956 1294.0144 1356.1977 1410.3382 1458.0282 1552.2714 1590.1077 2197.5843 3148.2749 3170.0514 3177.4757 3181.9849
redmass: 15.2712 7.3856 5.1631 9.9792 9.6676 5.4348 9.5345 9.1245 6.4264 3.9360 7.1510 5.4440 7.2899 2.1847 9.8394 1.4063 1.4247 1.4352 8.7363 5.8167 1.3429 2.1029 1.5722 1.0830 2.3170 1.5599 6.3707 3.2340 2.5138 6.3808 6.5234 12.8874 1.0875 1.0933 1.0943 1.0988
irintensity: 0.1230 0.0386 0.6957 0.1057 1.8296 0.0015 2.5998 0.8033 0.5761 7.0980 1.6400 0.0822 2.4995 30.2889 110.0561 55.2650 17.9402 6.9437 25.0494 12.1318 0.7358 19.8686 2.7926 0.7883 5.9768 1.0724 2.1637 8.9437 77.8218 83.4825 122.1643 1491.8369 6.0195 2.0407 2.9875 6.1341
temp: 298.150 k
press: 1.00000 atm
elementType: 53 16 7 6 6 6 6 6 6 6 1 1 1 1
symmnumber: 1
zpe: 233883.4 jmol-1
zpe.correction: 0.089081 hartree
zpe.thermalcorrener: 0.098376 hartree
zpe.thermalcorrenthalpy: 0.099320 hartree
zpe.thermalcorrgfe: 0.050692 hartree
zpe.sumelectzpe: -732.772517 hartree
zpe.sumelectthermal: -732.763222 hartree
zpe.sumelectthermalent: -732.762278 hartree
zpe.sumelectthermalfe: -732.810906 hartree
dipole: -1.7009 2.3902 -0.0009
dipole: 2.9336
quadrupole: -91.1346 -70.1387 -82.9068
quadrupole: 4.7268 -0.0066 0.0059
quadrupole: -9.7412 11.2547 -1.5134 4.7268 -0.0066 0.0059
hfenergy: -732.8615984 hartree
pointgroup: C01 [X(C7H4I1N1S1)]
dipole: 0.831031 0.7924719 -0.1162274 debye
dipolederiv: -0.3425914 0.2228621 -0.0198019 0.3167846 -0.2348664 0.0234191 -0.0315168 0.0254419 0.0078928 -1.3667504 -0.2673562 0.0614359 -0.3648428 -0.1303003 0.0166392 0.0762787 0.015153 -0.0633184 -2.7131669 -0.5112568 0.1223903 -0.6964828 -0.2979612 0.0494528 0.13943 0.0439696 -0.0303058 1.6356456 0.2669684 -0.0685663 0.2621841 0.3489592 -0.0354316 -0.066276 -0.0349506 0.1188806 -0.6427365 0.0817549 0.0016322 0.3721578 -0.1665182 -0.0019376 -0.0337669 0.0051299 -0.1132493 -0.3023817 -0.065481 0.0110803 -0.2304524 -0.0905363 -0.0042446 0.0322285 -0.0080987 -0.1680941 0.837867 -0.5561747 0.0470592 -0.7724554 0.5836199 -0.0733365 0.0735957 -0.0782079 -0.1371926 0.1844403 -0.0737483 0.0021815 0.1162979 0.1152493 -0.0316223 -0.021554 -0.0275016 -0.1145925 -0.3550523 0.2632536 -0.0272717 0.1877788 -0.3114986 0.0203245 -0.0179865 0.0186611 -0.1164294 2.9511017 0.6537735 -0.1448067 0.8474797 0.1338256 -0.0421126 -0.1683545 -0.0379938 -0.0528802 0.1012777 -0.0333496 0.0058522 -0.0507045 0.0039414 0.022161 0.0081478 0.0219052 0.1706863 0.0090491 0.0845684 -0.006693 0.0782821 0.0371704 0.0153463 -0.0057884 0.0151431 0.1733267 0.0386748 -0.0223861 0.0055445 -0.0374661 -0.0897381 0.0321464 0.0074183 0.0318273 0.1586951 -0.035377 -0.043428 0.0099634 -0.0285607 0.0986533 0.0091959 0.0081443 0.0095216 0.1665808 unknown
polarizability: 245.2640065|-0.8524216|117.3673622|-4.4769889|-9.7480311|39.7697425 unknown
InChI: InChI=1S/C7H4INS/c8-6-2-1-3-7(4-6)9-5-10/h1-4H
charge 0 multiplicity 1
14 atoms
I  3.420905 -1.921235 0.165747
S  -4.525384 -0.932833 0.219885
N  -1.797561 -0.175648 0.068698
C  -0.471761 0.192359 -0.008318
C  0.540672 -0.805187 0.091461
C  -0.117458 1.55808 -0.185925
C  1.890639 -0.414877 0.012507
C  1.242905 1.914607 -0.26076
C  2.26198 0.937212 -0.162982
C  -2.95885 -0.498742 0.130736
H  0.25329 -1.850604 0.227636
H  -0.905103 2.31329 -0.26167
H  1.520357 2.964783 -0.39714
H  3.314269 1.226594 -0.222576
