program: Gaussian 09
title: 000013550
version: EM64L-G09RevD.01
frameworkgroup: C1[X(C6H10O2)]
method: RPBEPBE
basis: SDD
operation: Freq
keyword: #pfreq=noraman
keyword: PBEPBE/SDD
title: #p freq=noraman PBEPBE/SDD
converged: NO YES NO YES
title: Mulliken charges:
elementType: O O C C C C C C H H H H H H H H H H
charge: -0.277524 -0.251084 -0.380887 -0.235511 -0.678603 0.251370 -0.209689 -0.475558 0.216122 0.216113 0.223154 0.223187 0.213002 0.226233 0.212980 0.251499 0.227977 0.247217
chargesum: 0.00000
title: Mulliken charges with hydrogens summed into heavy atoms:
elementType: O O C C C C C C
charge: -0.277524 -0.251084 0.051349 0.210830 -0.026387 0.251370 0.041810 -0.000363
polarizability: 1.10950512e+02 -6.35134843e-01 6.48681254e+01 -6.03387558e-03 6.05669127e-04 4.47622676e+01
1716.lowfreq: -2.0358 -0.9569 -0.0012 -0.0010 -0.0009 12.2580 43.8149 69.0939 105.7246
frequency: 42.8852 69.0166 105.7200 115.3725 207.6282 220.4427 240.1539 308.9452 331.4231 505.0374 507.7620 646.0878 755.8553 780.0835 841.7429 877.8362 891.2061 961.2367 992.9429 1005.8574 1051.1703 1061.6545 1133.5058 1137.5175 1143.4757 1228.3607 1278.5731 1286.1957 1306.9407 1370.9436 1395.2185 1409.6592 1471.0238 1478.2180 1479.7243 1490.1292 1620.2357 1641.7869 2980.0448 2996.7669 3004.7363 3043.4375 3063.8156 3084.5929 3085.3886 3103.9343 3158.0793 3220.3862
redmass: 3.0859 2.0535 3.6629 2.5534 2.5653 1.1310 3.2634 4.8309 3.5026 4.1860 1.7683 3.9187 1.0793 3.3476 4.6352 1.1549 2.0063 3.9353 1.4000 1.0798 2.7607 1.6125 3.6015 2.4481 1.4798 1.2568 1.0981 1.4029 1.3714 1.5060 1.2086 1.2330 1.0730 1.0600 1.0412 1.0852 11.3190 4.6036 1.0360 1.0590 1.0584 1.1019 1.1044 1.0991 1.1045 1.0597 1.0957 1.1158
irintensity: 0.0039 2.0663 2.1128 1.6047 5.8320 0.0360 1.3166 11.7211 4.4402 1.2774 0.0384 1.9373 8.8430 22.0321 10.2898 2.7239 8.5640 60.3700 42.9984 44.7484 14.9729 15.1155 286.5780 135.4566 0.3168 0.4394 0.0274 34.0826 3.4450 6.2042 21.1485 63.7459 1.4393 2.2914 13.3376 18.6182 147.5909 17.4595 31.1679 4.2574 40.2892 1.1293 0.0732 42.2420 95.7593 4.6221 4.3530 8.5359
temp: 298.150 k
press: 1.00000 atm
elementType: 8 8 6 6 6 6 6 6 1 1 1 1 1 1 1 1 1 1
symmnumber: 1
zpe: 389580.4 jmol-1
zpe.correction: 0.148383 hartree
zpe.thermalcorrener: 0.157934 hartree
zpe.thermalcorrenthalpy: 0.158879 hartree
zpe.thermalcorrgfe: 0.112999 hartree
zpe.sumelectzpe: -384.428560 hartree
zpe.sumelectthermal: -384.419009 hartree
zpe.sumelectthermalent: -384.418065 hartree
zpe.sumelectthermalfe: -384.463945 hartree
dipole: 0.7292 -1.6309 0.0001
dipole: 1.7865
quadrupole: -38.0794 -52.0010 -49.1505
quadrupole: 4.3272 -0.0019 0.0001
quadrupole: 8.3309 -5.5907 -2.7402 4.3272 -0.0019 0.0001
hfenergy: -384.5769435 hartree
pointgroup: C01 [X(C6H10O2)]
dipole: 0.2922301 0.6392247 0.0016388 debye
dipolederiv: -1.7556379 -0.2138567 -0.000294 -0.2541425 -0.5133763 -0.0005751 -0.0003077 -0.0005223 -0.2880873 -0.6828461 0.0520307 0.0001977 -0.1529166 -0.916173 -0.0014148 -0.0004041 -0.0016858 -0.326938 -0.0304178 0.0001612 0.0000839 0.0421349 0.0750117 -0.0001952 0.0002358 -0.0001786 0.1474465 0.9055329 -0.031762 -0.0002487 -0.1655157 0.2161886 -0.0003957 -0.000511 -0.0003798 0.364516 -0.0543906 0.0223805 0.0001313 -0.0493937 0.0442993 -0.0001886 -0.0001304 -0.0002313 0.0982893 1.8843255 0.0964786 0.000023 0.291751 1.1097706 0.0020473 0.0006192 0.0022505 0.2634074 -0.5108392 0.1510221 0.0004448 0.0609184 0.0494129 0.0006217 0.0000949 0.0006426 -0.1734787 0.0555008 -0.0703555 -0.0001491 0.0781519 0.0677222 0.0009861 0.0001725 0.0010086 -0.295593 0.0492253 0.0255823 -0.0227429 -0.0060365 -0.0164249 0.109207 -0.014833 0.1316861 -0.0685386 0.0492031 0.0252465 0.0227923 -0.006272 -0.0148801 -0.1088814 0.0146466 -0.1314002 -0.0701884 -0.051637 -0.0057824 -0.0136482 0.0583475 -0.0035209 -0.0843909 0.0087424 -0.0990702 -0.0654917 -0.0516304 -0.0058719 0.0136528 0.0583871 -0.0045407 0.084704 -0.0084271 0.0993948 -0.0644013 0.0818471 0.010302 -0.0130093 0.0571492 -0.0067285 -0.1218826 0.0325361 -0.132922 -0.0846719 -0.13783 -0.1059244 -0.0003265 -0.1363353 -0.0054881 -0.0003968 -0.0004257 -0.0003954 0.1058784 0.081896 0.0102633 0.0130063 0.0574554 -0.0086687 0.1224371 -0.0321842 0.1334929 -0.0827453 0.0728598 -0.0412043 -0.0001235 0.0116254 -0.0618207 -0.0006709 0.0000155 -0.0006652 0.1804853 -0.0242651 0.0859843 0.000231 0.0951263 0.0231325 -0.0004 0.000277 -0.0004179 0.1729397 0.1191036 -0.0046942 -0.0000209 -0.0404347 -0.0339162 -0.0006111 -0.0001171 -0.0006068 0.1871717 unknown
polarizability: 110.957913|0.2496098|64.8605719|-0.0065632|0.0553994|44.7624205 unknown
InChI: InChI=1S/C6H10O2/c1-3-5-8-6(7)4-2/h4H,2-3,5H2,1H3
charge 0 multiplicity 1
18 atoms
O  0.12225 0.502416 0.000348
O  -1.156011 -1.455829 -0.004741
C  2.550367 0.630558 0.000441
C  1.359988 -0.329294 -0.002122
C  3.889602 -0.139971 -0.002841
C  -1.089359 -0.200924 -0.001173
C  -2.228531 0.753572 0.00134
C  -3.513593 0.314568 0.000032
H  2.487057 1.288612 -0.886167
H  2.488064 1.282772 0.891422
H  1.346388 -0.977559 -0.898497
H  1.346515 -0.982633 0.890551
H  3.982551 -0.781675 -0.898876
H  4.743607 0.559944 -0.000376
H  3.98302 -0.788484 0.888237
H  -1.97073 1.81766 0.004268
H  -4.357906 1.011499 0.001898
H  -3.730379 -0.760133 -0.002945
