program: Gaussian 09
title: 000151075
version: EM64L-G09RevD.01
frameworkgroup: C1[X(C15H14N2O2)]
method: RPBEPBE
basis: SDD
operation: Freq
keyword: #p
keyword: freq=noraman
keyword: PBEPBE/SDD
title: #p freq=noraman PBEPBE/SDD
converged: YES YES NO NO
title: Mulliken charges:
elementType: O O N N C C C C C C C C C C C C C C C H H H H H H H H H H H H H H
charge: -0.223866 -0.292846 -0.655695 -0.593868 0.363990 0.111303 0.198151 -0.713602 -0.415416 -0.365006 -0.019256 -0.277827 0.236941 0.261529 -0.335253 -0.356992 -0.234663 -0.233069 -0.231771 0.219883 0.265832 0.220770 0.266765 0.229610 0.322362 0.358010 0.261743 0.272934 0.232474 0.231913 0.231322 0.325165 0.338430
chargesum: 0.00000
title: Mulliken charges with hydrogens summed into heavy atoms:
elementType: O O N N C C C C C C C C C C C C C C C
charge: -0.223866 -0.292846 0.024677 0.069727 0.363990 0.111303 0.198151 -0.227888 -0.194646 -0.098241 -0.019256 -0.048216 0.236941 0.261529 -0.073510 -0.084057 -0.002189 -0.001155 -0.000449
polarizability: 2.45988847e+02 -1.97445343e+01 1.98049169e+02 -2.15741660e+01 1.62510098e+00 1.15203048e+02
1716.lowfreq: -12.4770 -5.8176 -3.9787 -0.0003 0.0001 0.0006 31.6763 40.1882 47.8935
frequency: 31.4358 40.1528 47.8484 55.3120 86.1806 110.7242 135.8544 184.3788 205.8880 224.5509 268.6269 284.5494 294.9603 364.0511 403.0027 410.7720 414.2420 443.5959 467.0342 493.2185 517.1083 526.0357 537.1895 549.9787 577.7610 593.0820 612.3246 625.9408 667.8307 696.6702 707.1596 722.9919 735.1593 749.7206 779.6437 809.1778 821.1917 859.9430 863.4090 868.3282 921.7631 933.5741 941.3812 956.6345 969.6929 987.0744 989.8180 1003.2839 1025.1130 1059.4713 1081.2486 1091.9183 1140.7686 1156.6144 1171.7006 1173.2420 1185.9582 1194.3850 1263.0256 1281.1756 1290.8709 1308.7819 1316.9630 1369.9001 1381.9210 1396.2600 1431.5302 1453.7073 1453.9871 1471.5952 1474.7846 1524.9814 1575.2781 1583.4485 1585.5305 1604.8459 1610.8570 1635.2240 1694.1652 2988.8977 3062.1061 3110.3927 3127.5475 3137.1640 3145.7845 3147.9229 3157.9649 3167.6410 3168.5340 3322.3130 3520.3101 3610.0596 3675.0535
redmass: 4.8955 5.9522 4.4710 5.4085 4.3988 5.4722 7.5528 5.1413 4.3922 4.8938 5.1676 5.6166 4.7591 7.5424 2.8397 4.0693 2.3179 3.2373 2.9598 2.2703 1.4095 1.4092 3.4914 2.8620 3.8377 4.4351 6.3908 1.8378 3.7566 3.2931 2.0881 2.6444 1.3099 1.9857 1.8720 3.0028 4.7593 2.1906 1.7533 3.6945 1.6965 1.7607 1.5659 2.6771 1.3838 1.7614 3.1935 1.3299 2.1375 1.7404 1.5798 1.9468 1.9358 1.3155 1.1652 1.0616 1.1386 2.7606 1.8644 2.8646 1.5964 1.8824 1.4273 3.9017 8.8369 5.2518 2.2536 2.1446 1.3886 2.5934 2.5026 9.9098 4.5993 3.3780 5.1121 5.5548 3.3159 2.1058 1.1779 1.0613 1.1001 1.0892 1.0850 1.0880 1.0887 1.0926 1.0962 1.0989 1.1011 1.0648 1.0453 1.0873 1.1040
irintensity: 3.6894 0.8595 5.6656 6.8715 4.2539 3.7423 1.4580 1.1965 12.0826 6.6888 1.7919 4.0404 0.5565 6.6985 0.4546 6.2887 3.0791 2.3348 16.3074 7.6318 97.7163 54.5863 26.0957 60.1729 17.9639 2.7310 0.0864 144.5813 10.6196 6.1691 65.4802 162.7985 73.2313 86.2161 18.3378 9.9327 1.3591 11.3300 7.0974 7.1623 4.9578 3.0888 11.3679 52.4619 4.7474 0.8572 3.3690 0.9632 2.1664 1.3248 9.1407 17.3726 6.6198 15.4015 10.4105 0.2673 15.0384 13.7604 33.7217 283.2560 0.3785 15.2795 20.7746 173.7050 5.7546 3.9558 4.9813 45.3621 22.9201 58.8674 32.6503 171.8984 62.8857 34.4874 4.1518 28.2875 48.4733 400.9730 28.5365 26.5170 13.1666 21.0627 0.2147 4.4471 4.7495 17.5385 18.5710 28.5482 16.2494 379.6556 44.9205 81.1862 26.2668
temp: 298.150 k
press: 1.00000 atm
elementType: 8 8 7 7 6 6 6 6 6 6 6 6 6 6 6 6 6 6 6 1 1 1 1 1 1 1 1 1 1 1 1 1 1
symmnumber: 1
zpe: 680801.9 jmol-1
zpe.correction: 0.259304 hartree
zpe.thermalcorrener: 0.275871 hartree
zpe.thermalcorrenthalpy: 0.276815 hartree
zpe.thermalcorrgfe: 0.213962 hartree
zpe.sumelectzpe: -838.640376 hartree
zpe.sumelectthermal: -838.623809 hartree
zpe.sumelectthermalent: -838.622865 hartree
zpe.sumelectthermalfe: -838.685718 hartree
dipole: -4.5693 -3.1271 2.0251
dipole: 5.8956
quadrupole: -79.1606 -118.2919 -109.0812
quadrupole: -9.1785 -8.8714 -2.5016
quadrupole: 23.0173 -16.1140 -6.9033 -9.1785 -8.8714 -2.5016
hfenergy: -838.8996799 hartree
pointgroup: C01 [X(C15H14N2O2)]
dipole: 1.8349582 1.3236342 0.510877 debye
polarizability: 246.1700622|-16.5658964|194.9780029|22.3649193|-17.4682321|118.0929986 unknown
InChI: InChI=1S/C15H14N2O2/c16-13(18)9-11-7-4-8-12(14(11)17)15(19)10-5-2-1-3-6-10/h1-8H,9,16-17H2
charge 0 multiplicity 1
33 atoms
O  -2.166443 -2.503796 0.029807
O  2.435891 2.4703 -1.052022
N  0.435245 0.464777 -1.327728
N  4.311407 2.047359 0.238125
C  2.289054 -0.677087 -0.229751
C  0.871041 -0.507965 -0.436753
C  -0.03204 -1.416602 0.226579
C  3.292414 0.164657 -1.018528
C  2.75655 -1.694605 0.623823
C  0.492534 -2.460485 1.036945
C  -1.52472 -1.403764 0.073196
C  1.870662 -2.594904 1.265366
C  -2.306477 -0.113099 0.046592
C  3.309981 1.648835 -0.619796
C  -1.85683 1.05499 0.720744
C  -3.579069 -0.104976 -0.584822
C  -2.66709 2.210153 0.757909
C  -4.378572 1.056158 -0.564337
C  -3.924919 2.216262 0.109153
H  4.299876 -0.27299 -0.907181
H  3.032405 0.137185 -2.094875
H  3.839324 -1.813963 0.761023
H  -0.222727 -3.155767 1.488563
H  2.255853 -3.389001 1.911905
H  -0.562586 0.577302 -1.49456
H  1.038041 1.281093 -1.516416
H  -0.884165 1.048157 1.224722
H  -3.923119 -1.023652 -1.071576
H  -2.319531 3.102649 1.289576
H  -5.354009 1.058262 -1.063015
H  -4.54906 3.116797 0.132373
H  4.998122 1.392639 0.606684
H  4.332256 3.01858 0.550374
