program: Gaussian 09
title: 000151056
version: EM64L-G09RevD.01
frameworkgroup: C1[X(C11H9N5S2)]
method: RPBEPBE
basis: SDD
operation: Freq
keyword: #p
keyword: freq=noraman
keyword: PBEPBE/SDD
title: #p freq=noraman PBEPBE/SDD
converged: YES YES NO NO
title: Mulliken charges:
elementType: S S N N N N N C C C C C C C C C C C H H H H H H H H H
charge: 0.020916 0.081729 -0.389001 -0.041438 0.004676 -0.027558 -0.593927 0.319338 -0.052831 -0.311160 -0.220126 -0.042724 -0.199882 -0.171985 -0.238218 -0.220685 -0.207052 -0.222526 0.327904 0.266380 0.297998 0.256219 0.231641 0.233462 0.232761 0.336617 0.329472
chargesum: 0.00000
title: Mulliken charges with hydrogens summed into heavy atoms:
elementType: S S N N N N N C C C C C C C C C C C
charge: 0.020916 0.081729 -0.061096 -0.041438 0.004676 -0.027558 0.072163 0.319338 -0.052831 -0.311160 0.046254 -0.042724 -0.199882 0.126013 0.018001 0.010956 0.026410 0.010235
polarizability: 3.30791110e+02 1.18240052e+01 1.96826982e+02 5.08610753e+00 -3.16199090e+00 1.00268987e+02
1716.lowfreq: -7.3899 -2.1736 0.0018 0.0022 0.0026 6.9026 12.1876 38.3467 42.4693
frequency: 11.9606 38.3127 42.4186 79.4233 81.4423 123.9601 162.5900 169.1744 223.4585 229.6970 285.1088 309.5359 351.5200 380.2277 386.0065 392.2483 410.3039 445.1159 484.1795 498.4346 515.8183 534.9914 573.3207 601.7017 608.8457 628.6481 639.1211 676.6161 694.7839 718.8390 758.0053 774.6093 786.2752 840.3790 855.0490 868.1322 899.5120 936.6364 953.9792 982.5228 986.4635 1005.3601 1014.0743 1054.0385 1065.2750 1074.7775 1081.7623 1143.8244 1172.4445 1186.7419 1248.8041 1285.0683 1307.7538 1315.7528 1336.8725 1369.6095 1376.4599 1426.8476 1433.8171 1455.9730 1478.7001 1507.1106 1579.5985 1584.3549 1591.1853 1607.7502 3123.6863 3132.1962 3143.0320 3154.6224 3168.1475 3236.2505 3564.5130 3585.1609 3723.1689
redmass: 8.1380 5.0988 4.9131 7.3025 9.1697 6.1908 6.4636 6.6717 6.8464 8.3119 6.9302 3.7817 7.6035 10.8905 9.0535 7.6836 3.7399 1.1852 3.6557 6.0586 1.0881 8.0835 5.1966 2.1048 6.4656 5.6952 1.7859 6.7974 2.2313 11.8606 1.4978 9.7711 9.4847 1.4569 1.2413 8.7923 7.7162 1.3729 4.5282 5.8057 1.3922 1.3273 3.7545 2.4599 2.3071 1.6003 1.8402 3.4174 1.0561 1.1237 2.7290 4.7449 1.3529 3.9522 4.5029 3.0569 8.9028 2.1475 3.6467 2.0103 3.8555 6.3164 6.1242 5.7888 5.1372 1.6736 1.0886 1.0879 1.0923 1.0959 1.1014 1.0988 1.0442 1.0823 1.1059
irintensity: 0.1863 1.4063 0.1301 2.1022 2.0498 17.0807 2.5286 2.1797 2.1523 0.1744 5.3239 11.4319 1.1701 12.1759 14.2323 1.9002 0.2982 247.0529 15.3364 1.7972 34.4723 1.8483 16.8361 105.6974 0.6146 1.0337 15.9985 0.8247 34.6937 6.1057 66.4334 0.7822 3.5174 20.9828 0.6145 41.3607 7.4802 2.3398 4.3140 1.0897 0.1866 0.1625 5.8250 13.9516 6.5867 4.4761 20.0134 16.5956 0.0332 10.2269 67.9589 95.3622 2.1345 127.6078 47.2624 31.9695 1.5044 12.2769 26.9010 16.8419 58.4673 431.8339 0.3244 0.3060 23.3764 435.0098 12.2008 7.0726 2.3888 22.4917 40.5876 1.1933 110.2136 54.3109 48.0474
temp: 298.150 k
press: 1.00000 atm
elementType: 16 16 7 7 7 7 7 6 6 6 6 6 6 6 6 6 6 6 1 1 1 1 1 1 1 1 1
symmnumber: 1
zpe: 499286.0 jmol-1
zpe.correction: 0.190168 hartree
zpe.thermalcorrener: 0.205903 hartree
zpe.thermalcorrenthalpy: 0.206847 hartree
zpe.thermalcorrgfe: 0.144360 hartree
zpe.sumelectzpe: -1493.200824 hartree
zpe.sumelectthermal: -1493.185089 hartree
zpe.sumelectthermalent: -1493.184145 hartree
zpe.sumelectthermalfe: -1493.246632 hartree
dipole: 2.9983 -1.3745 -0.8357
dipole: 3.4026
quadrupole: -117.3561 -98.4483 -121.3268
quadrupole: 19.9959 -0.5129 3.2908
quadrupole: -4.9791 13.9288 -8.9497 19.9959 -0.5129 3.2908
hfenergy: -1493.3909915 hartree
pointgroup: C01 [X(C11H9N5S2)]
dipole: 1.314953 0.2020527 -0.1488491 debye
polarizability: 308.851036|-53.6396736|129.3590064|23.0673272|-42.720669|189.6770363 unknown
InChI: InChI=1S/C11H9N5S2/c12-11-15-9-8(13-6-14-9)10(16-11)18-17-7-4-2-1-3-5-7/h1-6,13H,12H2
charge 0 multiplicity 1
27 atoms
S  0.546476 1.073761 -1.677747
S  1.730191 -0.893552 -1.68302
N  -2.623894 2.083727 -2.154648
N  -4.48312 1.632696 -0.88858
N  -3.363769 0.130759 0.734941
N  -0.945339 -0.169115 0.335289
N  -2.057904 -1.281924 2.074444
C  -2.193113 1.242523 -1.122698
C  -3.372195 0.961907 -0.339549
C  -0.974982 0.647187 -0.736632
C  -3.992336 2.28099 -1.960211
C  -2.135513 -0.410076 1.012274
C  2.886086 -0.674233 -0.273549
C  2.406666 -0.539705 1.052353
C  4.276348 -0.718765 -0.543432
C  3.333416 -0.452075 2.113408
C  5.194525 -0.657014 0.530337
C  4.725393 -0.519068 1.857071
H  -2.048643 2.457217 -2.908857
H  -4.586679 2.906631 -2.623241
H  1.324898 -0.48947 1.222964
H  4.629901 -0.798274 -1.57673
H  2.970875 -0.335507 3.140804
H  6.270007 -0.700484 0.326821
H  5.439116 -0.45609 2.68606
H  -2.905436 -1.494356 2.593467
H  -1.175975 -1.73839 2.287062
