program: Gaussian 09
title: 000151052
version: EM64L-G09RevD.01
frameworkgroup: C1[X(C8H11N3O4)]
method: RPBEPBE
basis: SDD
operation: Freq
keyword: #p
keyword: freq=noraman
keyword: PBEPBE/SDD
title: #p freq=noraman PBEPBE/SDD
converged: YES YES NO NO
title: Mulliken charges:
elementType: O O O O N N N C C C C C C C C H H H H H H H H H H H
charge: -0.414088 -0.233763 -0.411179 -0.202855 -0.188211 -0.550601 -0.082145 -0.537058 0.450551 -0.201015 -0.481766 -0.469364 -0.234665 0.186640 0.211931 0.246561 0.263436 0.240739 0.271306 0.275901 0.269690 0.251483 0.287894 0.282621 0.379579 0.388376
chargesum: 0.00000
title: Mulliken charges with hydrogens summed into heavy atoms:
elementType: O O O O N N N C C C C C C C C
charge: -0.034508 -0.233763 -0.022803 -0.202855 -0.188211 0.019914 -0.082145 -0.027061 0.450551 0.039724 0.065441 -0.199673 0.016818 0.186640 0.211931
polarizability: 1.17932409e+02 -6.12578145e+00 1.23551697e+02 1.37110005e+01 1.29513520e+00 1.00008159e+02
1716.lowfreq: -5.8032 0.0006 0.0008 0.0008 4.4589 6.3377 22.6238 31.9428 35.7012
frequency: 22.0633 31.8617 35.5737 46.1443 60.8116 91.9477 100.1308 173.3029 235.1582 241.2280 271.9623 280.3546 315.2671 356.4834 363.7762 404.7698 455.1056 485.7678 569.0989 591.4321 612.3500 633.8792 649.1001 655.3398 661.4029 703.3562 743.5172 759.7204 772.6012 786.8642 833.7397 846.5256 885.7382 952.8333 961.1901 983.3581 1041.0710 1042.6170 1099.7903 1101.5554 1120.2654 1153.0709 1192.2255 1209.2977 1236.1441 1252.2232 1255.8736 1266.9803 1319.7939 1326.2756 1338.9320 1359.9775 1369.7436 1384.8122 1431.9596 1456.9519 1468.2212 1548.3179 1646.3983 1656.6613 1688.5545 3008.1441 3015.0892 3048.6661 3072.5298 3079.9005 3222.4750 3228.5057 3445.5503 3496.4747 3521.4248 3572.1621
redmass: 6.7492 7.0770 8.3330 8.9402 5.8935 4.9964 5.1867 4.2479 3.4221 2.1359 3.8326 2.7633 1.6451 5.0062 5.0613 2.5199 4.1266 2.1786 4.3394 2.8050 1.3417 1.3780 3.2733 3.7225 1.5880 3.4619 4.0335 1.5900 3.7066 3.6143 1.5083 4.3406 4.5282 1.9852 2.3103 3.0817 2.6068 2.4165 1.6370 2.4118 2.7247 1.8194 1.5187 1.4916 1.5185 1.8971 1.6494 1.7282 1.4093 1.7164 1.9531 1.9471 1.4206 6.7874 1.6009 1.5751 1.1956 6.5111 1.0916 8.2966 8.9623 1.0602 1.0629 1.0873 1.1002 1.0982 1.0955 1.1017 1.0451 1.0639 1.0644 1.0974
irintensity: 0.2888 0.6347 0.3843 2.2979 1.9373 0.9668 1.1767 0.9546 13.8303 10.9202 1.0835 8.0962 30.9063 9.0680 3.6385 1.2528 27.2497 23.7115 42.4166 12.0977 127.4679 153.3806 11.2478 23.6974 239.2291 30.2954 14.1574 27.2451 3.0155 29.8168 21.1552 1.1464 11.7827 7.7990 12.0023 32.2401 283.7090 224.0593 30.7901 14.4624 13.5861 8.2672 1.7611 10.7976 4.5020 13.5312 1.1308 26.9593 3.0575 20.1600 12.3394 9.1389 7.2938 0.6231 28.5299 75.4904 15.9991 1.7957 47.3357 185.2620 182.1402 11.1790 19.7449 12.3703 17.8286 1.1308 4.2851 1.4850 2.6142 18.3011 35.5788 4.6117
temp: 298.150 k
press: 1.00000 atm
elementType: 8 8 8 8 7 7 7 6 6 6 6 6 6 6 6 1 1 1 1 1 1 1 1 1 1 1
symmnumber: 1
zpe: 515903.9 jmol-1
zpe.correction: 0.196497 hartree
zpe.thermalcorrener: 0.211664 hartree
zpe.thermalcorrenthalpy: 0.212609 hartree
zpe.thermalcorrgfe: 0.151137 hartree
zpe.sumelectzpe: -775.461118 hartree
zpe.sumelectthermal: -775.445951 hartree
zpe.sumelectthermalent: -775.445006 hartree
zpe.sumelectthermalfe: -775.506478 hartree
dipole: 1.0112 -4.3385 3.3904
dipole: 5.5982
quadrupole: -76.2320 -95.0025 -88.3694
quadrupole: -1.9488 0.8837 4.1388
quadrupole: 10.3027 -8.4679 -1.8348 -1.9488 0.8837 4.1388
hfenergy: -775.657615 hartree
pointgroup: C01 [X(C8H11N3O4)]
dipole: 0.2715246 -1.6915147 1.3842398 debye
dipolederiv: -0.3561904 -0.0389119 0.1198631 -0.0788031 -0.4111052 -0.3429648 0.0660597 -0.3004499 -1.0595307 -0.7276534 0.1534451 -0.2747096 0.226027 -0.4367619 0.041681 -0.1116635 -0.0585303 -0.7118218 -0.7907045 0.3747663 -0.3726972 0.3932339 -0.80179 0.3714462 -0.2974092 0.2798437 -0.4987757 -0.5206519 0.1724589 0.1103823 0.1910844 -0.4310452 -0.0005872 -0.0629182 0.1602088 -0.8693934 -0.2237638 0.2405425 -0.1089514 0.2923091 -0.5704911 0.2019004 -0.1402694 0.2771917 -0.2466135 -0.5784775 0.1139639 0.0587779 0.0239066 -0.7962902 -0.1378292 0.0658855 -0.139354 -0.2098883 -0.3665569 0.1038544 -0.0290767 0.0552032 -0.4788713 0.0727758 -0.10938 0.1170116 -0.284971 0.0907393 0.0104983 -0.0030104 0.0348064 0.0609937 -0.0436165 -0.0044445 0.0829666 0.1192901 0.1836679 -0.2201635 0.1473449 0.0395361 0.0929854 -0.0285901 0.1961581 -0.1477297 0.048803 0.2755021 0.1436489 0.0347843 0.1226359 0.4076801 0.0226635 0.0480016 0.0115051 0.1051491 0.2224331 -0.0729785 0.1238329 -0.1387764 0.3609285 -0.1236477 0.2681882 -0.2652305 0.0901994 -0.0095938 0.0400412 0.1498321 0.0282685 -0.0681691 -0.0475605 0.1652637 0.0067243 -0.0432168 -0.0393172 -0.0623619 0.1090146 -0.2263227 0.5389872 -0.1378961 0.0811805 -0.1348989 -0.0087716 0.8044737 -0.2773498 0.207071 -0.4602834 0.4273753 0.309167 0.1105838 0.367565 1.3303409 0.9418732 -0.6369227 0.0957405 -0.6997572 0.7941948 -0.2545257 0.1299844 -0.2849512 1.2068013 0.0219376 -0.0331312 -0.1023716 -0.0008036 0.0604321 0.0359952 -0.0587053 -0.0032957 -0.0243995 -0.0071553 0.0673794 0.0426795 0.0479144 -0.0535077 -0.0116727 0.0443386 -0.0132141 0.0780862 0.0199351 0.0233847 -0.0775552 0.0168256 0.0250369 0.0065826 -0.1067422 -0.0000134 -0.0768989 0.0501193 -0.0423075 0.0732845 0.011328 -0.0554641 0.0564559 0.0266257 0.0413027 0.0948173 0.0339423 0.0196352 -0.0770969 -0.0163022 0.0595679 -0.0730072 -0.0641595 -0.0081922 0.046084 0.0530649 0.0033925 -0.1082737 0.0259213 0.1085546 0.012987 -0.1149999 0.0001169 0.0952743 0.0446229 -0.0205138 -0.109567 -0.0090188 0.0991243 0.0111976 -0.1131723 -0.0045508 0.0957733 0.2029013 -0.0689868 -0.128322 -0.0090379 0.2264982 0.1220862 -0.094648 0.0568239 0.1432865 0.1288528 -0.1968174 0.075415 -0.0843583 0.2534861 -0.0074279 0.0558053 0.0134744 0.0917903 0.2185226 0.1457915 -0.0346577 0.1591832 0.252006 -0.0059264 -0.0920932 0.0190554 0.3164392 0.3274765 0.0576421 0.0782668 0.0552798 0.3356446 -0.0496865 0.1125301 -0.0733794 0.1721467 unknown
polarizability: 116.8346678|-5.3361402|124.311723|14.1229046|-0.3121004|100.3458745 unknown
InChI: InChI=1S/C8H11N3O4/c9-6(8(14)15)1-5-2-10-4-11(5)3-7(12)13/h2,4,6,12,14H,1,3,9H2
charge 0 multiplicity 1
26 atoms
O  -2.769255 0.414828 1.620079
O  -3.639151 0.196174 -0.526983
O  3.533957 -1.929644 0.863816
O  2.857018 -0.968119 -1.147847
N  1.073452 0.771741 0.347447
N  -2.211255 -2.480062 -0.31891
N  0.578932 2.88192 -0.324865
C  -0.665125 -0.645871 -0.915399
C  -0.011715 0.655671 -0.549421
C  -1.684764 -1.184489 0.137364
C  1.789206 -0.308423 1.00925
C  -0.292914 1.967818 -0.941035
C  1.39071 2.131517 0.437288
C  -2.792268 -0.132932 0.333405
C  2.756052 -1.061605 0.087992
H  -1.209147 -0.501656 -1.867178
H  0.074995 -1.448012 -1.088564
H  -1.184928 -1.329782 1.110458
H  1.088512 -1.050519 1.434484
H  2.366965 0.093711 1.858876
H  -1.066888 2.3036 -1.628043
H  2.202376 2.504341 1.059188
H  -2.722767 -2.413852 -1.20689
H  -2.746188 -2.991816 0.390444
H  -3.470213 1.118769 1.701584
H  4.149301 -2.447809 0.277659
