program: Gaussian 09
title: 000013546
version: EM64L-G09RevD.01
frameworkgroup: C1[X(C6H10O2)]
method: RPBEPBE
basis: SDD
operation: Freq
keyword: #pfreq=noraman
keyword: PBEPBE/SDD
title: #p freq=noraman PBEPBE/SDD
converged: YES YES NO NO
title: Mulliken charges:
elementType: O O C C C C C C H H H H H H H H H H
charge: -0.282467 -0.267848 0.451041 -0.775567 -0.799407 -0.449564 0.235344 -0.504337 0.227915 0.237382 0.228251 0.301687 0.220122 0.219881 0.249495 0.230198 0.238945 0.238930
chargesum: 0.00000
title: Mulliken charges with hydrogens summed into heavy atoms:
elementType: O O C C C C C C
charge: -0.282467 -0.267848 0.451041 -0.082020 -0.057718 -0.200069 0.235344 0.203736
polarizability: 1.15294776e+02 4.56542211e+00 6.90598548e+01 3.26756648e-02 2.46606649e-04 4.60857098e+01
1716.lowfreq: -5.1686 -0.0012 -0.0008 -0.0008 5.9577 6.4243 62.5778 64.5829 100.2529
frequency: 62.4041 64.4768 100.2336 122.1620 161.2778 164.9179 244.0974 300.5357 329.8368 369.3263 463.8919 464.4740 688.3338 693.5802 826.2073 871.4860 873.6333 948.9840 981.7675 986.4915 1071.9562 1087.4761 1112.3239 1121.9772 1149.2234 1239.3428 1361.9365 1388.3068 1397.0350 1422.8941 1449.9140 1451.1886 1455.9311 1464.0732 1468.0904 1485.9174 1616.8054 1663.0900 2965.7695 2970.7373 2999.5079 3035.8072 3043.0088 3094.0424 3097.9282 3125.2727 3143.5278 3145.4540
redmass: 1.3076 2.1323 1.2883 1.8683 3.4228 1.2088 3.1915 4.1708 2.9764 4.8017 2.9739 2.3017 5.3719 3.9439 4.0810 1.4657 5.8857 1.4750 3.9715 1.2328 1.9797 1.7364 1.2682 2.2523 1.4539 3.5663 1.4779 1.3483 1.2176 1.1886 1.0683 1.0499 1.0500 1.0554 1.1018 1.0466 8.4562 5.8685 1.0386 1.0386 1.0298 1.0957 1.0955 1.0988 1.1040 1.0973 1.1043 1.0906
irintensity: 2.0977 1.7419 1.9343 1.9315 2.5609 0.0275 4.7643 19.7563 0.6402 3.9095 1.6810 9.8522 6.9471 2.5226 1.9306 25.3690 19.9068 2.2237 19.0923 7.8963 187.6814 7.6744 0.0743 208.8747 7.2544 57.5756 19.8292 41.5552 22.0741 17.2408 30.9531 13.6512 6.4379 27.5852 35.7349 29.8174 155.0587 167.0148 7.3898 50.3565 39.3841 4.2755 34.7861 24.7757 31.1173 1.6169 20.1282 7.9782
temp: 298.150 k
press: 1.00000 atm
elementType: 8 8 6 6 6 6 6 6 1 1 1 1 1 1 1 1 1 1
symmnumber: 1
zpe: 387271.0 jmol-1
zpe.correction: 0.147504 hartree
zpe.thermalcorrener: 0.157515 hartree
zpe.thermalcorrenthalpy: 0.158459 hartree
zpe.thermalcorrgfe: 0.111875 hartree
zpe.sumelectzpe: -384.438690 hartree
zpe.sumelectthermal: -384.428678 hartree
zpe.sumelectthermalent: -384.427734 hartree
zpe.sumelectthermalfe: -384.474318 hartree
dipole: 1.1391 -1.2108 0.0085
dipole: 1.6624
quadrupole: -35.4053 -52.0153 -48.9033
quadrupole: 0.8622 -0.0019 0.0024
quadrupole: 10.0360 -6.5740 -3.4620 0.8622 -0.0019 0.0024
hfenergy: -384.5861935 hartree
pointgroup: C01 [X(C6H10O2)]
dipole: -0.4515958 0.4677752 -0.0706967 debye
dipolederiv: -1.5047083 -0.2975285 0.0244107 -0.4962467 -0.6227079 0.0365324 0.0523634 0.0396425 -0.319759 -0.7346112 0.1220447 -0.0235949 0.0401753 -0.9363411 0.0881956 -0.0121906 0.0901855 -0.3357493 0.8045577 -0.0430124 0.0172562 0.2685265 0.3624298 -0.0544371 -0.0296623 -0.0590083 -0.0354912 -0.2203403 0.141088 -0.0234786 0.0298802 -0.0455411 0.0136973 -0.0036101 0.0147284 0.0485999 -0.2002212 -0.0515226 0.0034482 -0.0256581 -0.2567798 0.0461922 0.000002 0.0457417 0.0586399 -1.0534629 0.075371 -0.0225316 -0.0051043 -0.0751376 -0.0217043 -0.0106507 -0.0204322 -0.2213716 1.9957548 0.1687255 0.0015901 0.2150367 1.181278 -0.126236 -0.0042169 -0.1279 0.29031 0.7111357 0.0380069 0.001219 -0.0702919 0.2216717 0.0074516 0.0174393 0.0092241 0.2796719 -0.0110632 -0.0191373 -0.0940905 -0.0116855 0.0592505 -0.0830554 -0.1488531 -0.043798 -0.0238093 0.0691378 -0.0893217 0.0131488 0.004056 -0.1367403 0.0376311 -0.0016415 0.0362644 0.1052186 -0.015913 0.0091829 0.0953766 0.0317181 0.0880199 0.0493782 0.1446942 0.0102773 -0.0480557 0.1157205 0.1256195 -0.0183336 0.0558866 0.0514838 0.0106214 -0.0081242 0.0115032 0.1165059 0.0338165 -0.0554486 -0.1100668 -0.0751049 0.0595638 -0.019203 -0.128676 -0.0703862 -0.0332702 0.0265343 -0.0230444 0.123583 -0.0353157 0.0763816 -0.0140372 0.147079 0.0378021 -0.0427327 0.0687464 -0.0033895 -0.0011011 0.0198114 -0.0745127 0.0360788 -0.0048478 0.0357521 0.1669929 -0.043196 -0.0850171 0.0095235 -0.1409069 -0.0324897 0.0195249 0.0174749 0.0204323 0.1175688 -0.02178 -0.0057057 -0.0045387 0.106261 0.0129345 -0.1149948 0.0344518 -0.0984495 -0.0338114 -0.0201076 -0.0069106 0.0081798 0.0889623 0.0672365 0.0883643 -0.0610315 0.0684206 -0.0894576 unknown
polarizability: 115.2119868|4.9906066|68.6808537|0.2713966|-3.1811093|46.5475002 unknown
InChI: InChI=1S/C6H10O2/c1-5(2)4-6(7)8-3/h4H,1-3H3
charge 0 multiplicity 1
18 atoms
O  1.912851 0.82803 0.007665
O  1.048844 -1.317873 0.302597
C  -1.689326 0.108659 0.057544
C  -2.899461 1.011373 -0.088755
C  -1.992222 -1.359613 0.266547
C  -0.429039 0.64694 -0.002909
C  0.844707 -0.087495 0.12239
C  3.264141 0.236953 0.115328
H  -3.527328 0.684688 -0.940901
H  -2.62023 2.066497 -0.245868
H  -3.540356 0.949889 0.81279
H  -1.078514 -1.961767 0.367227
H  -2.59085 -1.746046 -0.582141
H  -2.616487 -1.490651 1.172724
H  -0.309553 1.724972 -0.157309
H  3.952886 1.086564 0.005116
H  3.423303 -0.509636 -0.681515
H  3.392836 -0.254785 1.09477
