program: Gaussian 09
title: 000151023
version: EM64L-G09RevD.01
frameworkgroup: C1[X(C11H20N2O5)]
method: RPBEPBE
basis: SDD
operation: Freq
keyword: #p
keyword: freq=noraman
keyword: PBEPBE/SDD
title: #p freq=noraman PBEPBE/SDD
converged: YES YES NO NO
title: Mulliken charges:
elementType: O O O O O N N C C C C C C C C C C C H H H H H H H H H H H H H H H H H H H H
charge: -0.439876 -0.283014 -0.214494 -0.419836 -0.230880 -0.397448 -0.611718 -0.430183 -0.009693 -0.122525 -0.713629 -0.727939 -0.557997 -0.403219 0.262690 -0.123789 0.148866 0.163636 0.207948 0.230407 0.192337 0.290942 0.319388 0.210344 0.201337 0.249724 0.212746 0.248988 0.213908 0.208749 0.274088 0.212225 0.258419 0.233461 0.307305 0.268709 0.388889 0.381131
chargesum: 0.00000
title: Mulliken charges with hydrogens summed into heavy atoms:
elementType: O O O O O N N C C C C C C C C C C C
charge: -0.050987 -0.283014 -0.214494 -0.038705 -0.230880 -0.078060 -0.035703 0.008172 0.182644 0.168417 -0.052224 -0.052296 -0.075160 0.067425 0.262690 0.109672 0.148866 0.163636
polarizability: 1.74014813e+02 6.58654386e+00 1.46413761e+02 3.47668555e+00 1.90032526e+00 1.28212219e+02
1716.lowfreq: -13.7754 -6.5550 -3.8929 0.0002 0.0005 0.0005 2.4891 10.3046 30.5808
frequency: -6.9726 9.4931 30.5425 37.3694 38.5532 50.5320 72.8372 85.4232 95.3677 112.4557 132.5929 179.8647 201.1168 206.3921 230.7111 238.1191 254.0479 282.4846 290.6303 295.9255 323.6447 343.1608 370.4073 384.7757 398.1001 481.8921 507.4619 530.9156 553.5047 566.5170 592.6376 594.8881 602.7062 607.7126 618.8981 679.7074 687.1913 720.6913 743.0913 789.8141 826.2257 837.2065 860.7950 923.8443 929.8730 954.6761 970.8780 989.5629 999.5362 1022.6296 1045.5323 1050.8626 1069.0919 1088.4344 1121.4855 1123.4604 1132.3216 1152.7465 1177.7803 1201.1284 1217.9958 1241.1755 1249.1021 1260.2289 1269.7171 1286.3314 1303.3168 1310.0324 1315.2541 1317.6145 1342.9772 1352.5867 1358.3296 1382.2302 1394.6000 1400.6338 1446.2615 1450.2750 1462.9848 1465.4859 1480.5432 1485.4554 1488.7256 1499.6417 1607.3665 1614.2409 1669.2951 1673.7662 2951.4270 2971.6350 2976.5261 2981.2691 2982.5564 2987.4993 2991.7477 3034.0876 3036.7828 3050.2535 3064.6124 3069.1750 3069.6250 3072.0426 3093.3996 3476.2744 3505.6562 3523.1340 3552.6163 3614.5727
redmass: 5.0920 5.4457 9.6552 3.1808 7.8364 4.9086 4.9246 6.6534 2.8388 3.3317 2.8713 3.0630 3.6843 3.7927 1.2018 1.2290 1.0703 3.7739 4.4089 4.4915 3.7433 2.7895 2.2046 2.6995 3.0921 4.3733 2.9127 2.9789 1.5669 1.7337 1.8100 1.7138 1.4964 1.8849 3.5458 3.3047 3.6979 3.8903 1.7911 3.3725 2.0809 2.4952 2.8253 1.3596 3.1308 1.5616 2.0060 2.8100 2.3084 2.4851 3.0842 2.8484 2.1163 2.6836 1.5958 1.7072 1.4648 2.2002 1.7784 1.9828 1.5745 1.3416 1.4697 1.3434 1.4949 1.5219 1.3181 1.4080 1.2419 1.4790 1.4354 1.5459 1.3694 1.2099 1.8010 1.2097 1.0880 1.1105 1.0440 1.0938 1.1599 1.0862 1.5496 1.0542 5.0744 1.3898 9.0301 3.5235 1.0796 1.0361 1.0481 1.0509 1.0605 1.0788 1.0685 1.0969 1.0974 1.0878 1.0994 1.1002 1.1018 1.0990 1.0982 1.0452 1.0639 1.0642 1.0775 1.0988
irintensity: 0.0403 0.0619 2.1450 0.2906 2.3170 3.0857 2.9226 6.2865 1.2016 1.8024 2.0497 12.1502 5.8956 0.3544 31.9557 8.4418 0.1824 8.5267 0.2937 1.7533 2.4289 1.5453 1.1548 7.4296 3.2288 25.0765 18.0524 34.5327 148.3504 80.7332 98.8833 167.8676 90.9853 133.0966 5.2097 53.5201 53.2340 22.6252 15.5799 7.9882 0.3401 8.6331 38.5547 1.2368 26.2860 4.8007 7.7207 3.6138 1.5245 9.5095 13.7021 245.5496 152.6497 55.2122 7.1619 16.4227 5.2949 27.7567 7.4340 5.5710 32.8946 15.1475 25.0589 24.9268 15.6269 32.2973 13.9634 1.3064 3.5746 11.3272 0.6451 27.8102 10.6766 21.7475 9.2048 20.9844 8.4011 44.0799 2.4872 18.9600 112.0080 13.4293 163.3976 8.3398 73.0027 221.0495 248.8866 129.7333 20.8855 37.1065 39.3563 33.1611 11.5486 15.9863 43.9180 11.9671 6.5101 18.9795 31.7753 22.6975 27.5273 46.3886 32.6395 11.6335 23.8875 31.7338 33.5558 10.9766
temp: 298.150 k
press: 1.00000 atm
elementType: 8 8 8 8 8 7 7 6 6 6 6 6 6 6 6 6 6 6 1 1 1 1 1 1 1 1 1 1 1 1 1 1 1 1 1 1 1 1
symmnumber: 1
zpe: 818074.1 jmol-1
zpe.correction: 0.311588 hartree
zpe.thermalcorrener: 0.331989 hartree
zpe.thermalcorrenthalpy: 0.332933 hartree
zpe.thermalcorrgfe: 0.259429 hartree
zpe.sumelectzpe: -915.383946 hartree
zpe.sumelectthermal: -915.363545 hartree
zpe.sumelectthermalent: -915.362600 hartree
zpe.sumelectthermalfe: -915.436104 hartree
dipole: -1.4907 -1.1118 -4.1718
dipole: 4.5676
quadrupole: -129.2398 -97.6044 -109.4792
quadrupole: -2.2066 5.7100 -2.0398
quadrupole: -17.1320 14.5034 2.6286 -2.2066 5.7100 -2.0398
hfenergy: -915.6955336 hartree
pointgroup: C01 [X(C11H20N2O5)]
dipole: -0.5930007 0.2128777 1.6829443 debye
polarizability: 174.0985035|-5.9481813|145.5368865|-4.1921922|4.1893323|129.0054033 unknown
InChI: InChI=1S/C11H20N2O5/c1-6(2)5-8(11(17)18)13-9(14)4-3-7(12)10(15)16/h6-8,13,15,17H,3-5,12H2,1-2H3
charge 0 multiplicity 1
38 atoms
O  -2.7000 2.346263 1.476122
O  -0.140002 -0.222517 -1.396835
O  -4.256889 2.109423 -0.231555
O  3.881592 -1.315781 1.454761
O  5.177665 -1.164532 -0.463346
N  -1.160009 0.378369 0.605378
N  4.813001 1.57846 -0.523244
C  -3.427156 -0.804719 0.572673
C  -3.158694 -2.212853 -0.033695
C  -2.523127 0.368192 0.061216
C  -1.831297 -2.860194 0.430549
C  -3.260245 -2.214535 -1.578519
C  1.297634 0.23107 0.550511
C  2.401887 0.778226 -0.380578
C  -0.045608 0.120569 -0.175806
C  3.841835 0.793172 0.247557
C  -3.250394 1.678433 0.365573
C  4.388403 -0.628408 0.344274
H  -3.34587 -0.852721 1.67744
H  -4.473257 -0.52832 0.333695
H  -3.985615 -2.844133 0.358447
H  -2.426627 0.293032 -1.036791
H  -1.03811 0.724418 1.558907
H  -1.805061 -3.925877 0.135459
H  -1.716003 -2.809804 1.529846
H  -0.962917 -2.367104 -0.037811
H  -3.25346 -3.250859 -1.963342
H  -2.400491 -1.689057 -2.033929
H  -4.192581 -1.730095 -1.925467
H  1.20502 0.863176 1.455602
H  1.57828 -0.780119 0.903207
H  2.164603 1.827495 -0.645498
H  2.404075 0.206248 -1.326162
H  3.75969 1.18782 1.279499
H  5.318338 1.035808 -1.230061
H  4.469365 2.482232 -0.853685
H  -3.229179 3.168511 1.660546
H  4.248602 -2.242086 1.459766
