program: Gaussian 09
title: 000151022
version: EM64L-G09RevD.01
frameworkgroup: C1[X(C6H5N2O8P)]
method: RPBEPBE
basis: SDD
operation: Freq
keyword: #p
keyword: freq=noraman
keyword: PBEPBE/SDD
title: #p freq=noraman PBEPBE/SDD
converged: YES YES NO NO
title: Mulliken charges:
elementType: P O O O O O O O O N N C C C C C C H H H H H
charge: 1.393257 -0.535905 -0.640947 -0.650836 -0.558855 -0.184183 -0.177508 -0.193330 -0.187825 0.019327 0.022325 0.304360 0.288207 -0.472622 0.438167 -0.275815 -0.369396 0.338667 0.296370 0.300184 0.411974 0.434384
chargesum: 0.00000
title: Mulliken charges with hydrogens summed into heavy atoms:
elementType: P O O O O O O O O N N C C C C C C
charge: 1.393257 -0.535905 -0.228974 -0.216452 -0.558855 -0.184183 -0.177508 -0.193330 -0.187825 0.019327 0.022325 0.304360 0.288207 -0.133955 0.438167 0.020555 -0.069212
polarizability: 1.99297099e+02 -5.25811649e+00 1.56784205e+02 1.02120546e+01 4.92310720e+00 6.88986620e+01
1716.lowfreq: -6.7201 -3.9998 -0.0012 -0.0008 0.0010 4.0352 22.2207 28.6197 39.2236
frequency: 22.1912 28.6042 39.2220 55.3393 65.7065 95.7582 146.2079 152.1834 172.2195 182.3427 203.2445 271.0154 297.7306 298.4886 309.2842 336.2872 343.0322 356.2681 375.2012 398.6893 438.5108 494.3829 519.2433 567.1116 588.7666 635.8141 654.1734 674.6252 696.2717 713.2332 746.8629 757.4778 777.6114 819.4043 857.6687 887.9727 959.1176 990.3825 996.9013 1009.0165 1055.8849 1107.8045 1120.6883 1150.8251 1199.0974 1215.9805 1235.4274 1265.8350 1360.4848 1374.1003 1399.3283 1425.4077 1469.7972 1589.5424 1605.6911 3151.8980 3187.3704 3189.1729 3548.8239 3589.7497
redmass: 9.3353 8.8058 14.2283 15.3060 10.0418 7.9066 13.2420 5.8628 4.4990 3.9088 7.4156 2.0538 3.4570 2.3823 6.4270 7.9973 2.6446 8.6358 5.1489 7.2416 4.5359 7.9078 4.7051 9.0744 6.1834 8.1927 8.2897 11.5557 11.0132 6.4757 4.9505 12.6073 9.8088 7.8774 1.4485 7.8913 1.4723 1.4996 1.3427 1.3821 2.1843 3.7909 3.2216 1.3741 10.1025 10.2222 3.4075 1.6150 6.1146 11.5355 10.6427 6.0012 2.7747 9.2686 7.0175 1.0924 1.0923 1.0953 1.0661 1.0666
irintensity: 2.0079 1.9099 0.1733 0.2363 3.1212 9.5620 3.7509 3.2928 46.0225 53.2320 3.5265 30.0573 38.7422 49.0066 1.0625 13.3998 46.4145 12.2875 109.3720 13.1560 14.7112 1.6316 3.8806 27.9403 5.6000 21.8954 3.9370 86.0916 214.1455 16.3122 9.8787 20.8633 292.8981 129.9653 53.6800 120.3755 27.5196 114.0648 0.2644 28.1644 66.3922 64.7189 192.9949 11.4125 281.1329 245.1419 211.1936 27.7776 79.4170 70.1515 51.7086 49.1088 147.8082 25.4039 153.3451 0.6861 21.2178 5.2854 103.5715 100.1449
temp: 298.150 k
press: 1.00000 atm
elementType: 15 8 8 8 8 8 8 8 8 7 7 6 6 6 6 6 6 1 1 1 1 1
symmnumber: 1
zpe: 330028.6 jmol-1
zpe.correction: 0.125701 hartree
zpe.thermalcorrener: 0.142527 hartree
zpe.thermalcorrenthalpy: 0.143471 hartree
zpe.thermalcorrgfe: 0.078489 hartree
zpe.sumelectzpe: -1282.714346 hartree
zpe.sumelectthermal: -1282.697520 hartree
zpe.sumelectthermalent: -1282.696576 hartree
zpe.sumelectthermalfe: -1282.761558 hartree
dipole: -3.4612 -2.0907 1.4081
dipole: 4.2818
quadrupole: -125.3143 -115.8249 -100.8825
quadrupole: 0.2839 -10.9886 -7.6497
quadrupole: -11.3071 -1.8177 13.1248 0.2839 -10.9886 -7.6497
hfenergy: -1282.840047 hartree
pointgroup: C01 [X(C6H5N2O8P1)]
dipole: 1.2725819 0.9610783 0.5428217 debye
dipolederiv: 2.8709898 0.1731263 -0.0190825 0.7324253 1.8023641 0.1291732 0.3300334 0.292145 1.9765034 -2.6290043 -0.4564962 -0.0673353 -0.4422394 -0.4189032 0.0002711 0.0355981 0.0238278 -0.3731664 -0.7083101 0.0558242 -0.02898 -0.0078308 -0.4566511 -0.0583618 -0.3004304 -0.1749261 -1.1085148 -0.8522988 0.2025168 0.0350122 0.4159747 -0.7313975 -0.1368867 0.0011195 -0.0641415 -0.6808586 -0.7496193 -0.1007416 -0.0070906 -0.1798815 -0.613139 0.036392 -0.0073065 -0.0268877 -0.6206272 -0.4698288 -0.0909681 0.1501749 -0.1182363 -0.7352798 0.1680776 0.1669703 0.1547366 -0.3162455 -0.6697487 0.1031018 0.1914226 0.1744952 -0.5379226 -0.0155557 0.1583667 0.0649287 -0.2935184 -0.6949895 0.2158306 -0.0076229 0.2191237 -0.6800839 0.0384346 0.0010851 0.0377944 -0.2210038 -0.7846498 -0.1487092 0.0292957 -0.185003 -0.5709625 0.0349701 0.0440929 0.0422114 -0.2171826 0.9460025 -0.2095569 -0.3769277 -0.198042 1.5226602 -0.2290897 -0.3407778 -0.2776725 0.4136562 1.9013693 -0.1498128 -0.0334199 -0.112579 1.0318459 -0.0741153 -0.0737751 -0.0827653 0.1955174 1.8504405 0.4699916 0.0439114 -0.4533772 0.2131635 -0.0531963 -0.0424234 -0.1118752 0.1382104 -0.4711259 0.1748946 0.0310699 -0.05934 -0.4584269 0.0617643 0.0011461 0.0504754 0.0160514 0.2179744 -0.2517434 0.0207543 -0.2707429 0.051984 -0.0178896 -0.003561 0.0584679 -0.0512706 -0.7069571 0.0753962 0.0015054 0.0728906 -0.2451995 0.0313238 0.021093 0.0403845 0.0503302 -0.5372124 0.0707425 -0.0228252 0.5240109 -0.0503693 0.0023843 -0.0376375 -0.0125908 -0.1261111 0.3640738 0.0269579 -0.0116351 0.1840959 0.0900418 -0.0276803 -0.0272339 -0.0186668 -0.0654874 0.1650851 -0.0190984 -0.0041202 0.0001498 0.1509394 0.004732 0.0242241 -0.0137865 0.1801182 0.0795386 -0.0450768 0.0208029 -0.0326386 0.0737186 0.0093498 0.0035478 0.0140858 0.1597321 0.1291269 0.037992 -0.0040666 0.0088547 0.0844997 0.0103139 -0.0022617 -0.000567 0.1682009 0.3443278 -0.065127 0.0312711 -0.0703034 0.207172 0.0525212 0.0227048 -0.003084 0.3750099 0.404816 -0.0690439 0.0278856 -0.2018067 0.269946 0.0330676 0.0254256 0.0079061 0.4006565 unknown
polarizability: 200.2486561|-1.6445582|155.5696923|-6.8273432|-9.3960332|69.1616183 unknown
InChI: InChI=1S/C6H5N2O8P/c9-7(10)4-1-2-6(16-17(13,14)15)5(3-4)8(11)12/h1-3,13-14H
charge 0 multiplicity 1
22 atoms
P  3.282473 1.193754 0.095567
O  2.029032 0.010105 -0.232772
O  3.186289 1.16106 1.807956
O  4.547946 0.17724 -0.37812
O  3.239436 2.624905 -0.570294
O  -0.424272 -3.175361 0.667838
O  1.50846 -2.567352 -0.37734
O  -4.077623 1.880631 -0.121024
O  -4.326486 -0.377772 0.11239
N  0.341917 -2.304819 0.099945
N  -3.607321 0.682771 -0.02639
C  0.657084 0.213113 -0.182235
C  -0.191162 -0.922663 -0.022053
C  -1.588964 -0.770009 0.039765
C  -2.132796 0.518871 -0.080596
C  0.075661 1.502233 -0.298935
C  -1.317122 1.659992 -0.250695
H  -2.232338 -1.641997 0.183825
H  0.724256 2.372581 -0.444469
H  -1.783125 2.644055 -0.345865
H  3.55572 1.95976 2.265688
H  4.310236 -0.787298 -0.430685
