program: Gaussian 09
title: 000013544
version: EM64L-G09RevD.01
frameworkgroup: C1[X(C4H9NO2)]
method: RPBEPBE
basis: SDD
operation: Freq
keyword: #pfreq=noraman
keyword: PBEPBE/SDD
title: #p freq=noraman PBEPBE/SDD
converged: YES YES NO NO
title: Mulliken charges:
elementType: O O N C C C C H H H H H H H H H
charge: -0.243384 -0.132619 0.130051 0.029352 -0.355229 -0.688493 -0.686588 0.207897 0.215152 0.195394 0.227873 0.231005 0.209975 0.232668 0.207775 0.219171
chargesum: 0.00000
title: Mulliken charges with hydrogens summed into heavy atoms:
elementType: O O N C C C C
charge: -0.243384 -0.132619 0.130051 0.237249 0.055316 -0.019640 -0.026974
polarizability: 8.16190299e+01 7.65401599e+00 5.71260989e+01 -1.12205677e+00 -2.57518116e-01 4.75664014e+01
1716.lowfreq: -12.6554 -8.1801 -0.0003 0.0008 0.0008 11.4975 33.7515 82.0911 167.8352
frequency: 33.5457 82.0777 167.8324 186.6356 212.4574 218.0076 256.5964 335.5012 417.7317 473.7339 529.2189 737.8868 771.1216 841.7139 876.4485 966.3449 990.6341 1036.9824 1110.6706 1127.8901 1172.4677 1259.1932 1290.9571 1316.4504 1349.2440 1385.9510 1392.3981 1451.7309 1463.4189 1474.8596 1477.3851 1487.0173 1531.4331 2981.3810 2983.6723 2987.4068 2990.0955 3039.7444 3077.7414 3088.0146 3091.0694 3098.0525
redmass: 5.8290 1.8760 5.0338 1.2650 1.7506 2.1107 2.0484 3.5070 3.2519 3.3224 3.5306 7.0155 1.3866 1.9506 2.9726 1.2763 1.3989 3.3363 2.0054 2.1350 2.1249 1.2233 1.2852 1.1949 1.6170 1.2182 1.2126 1.0734 1.0507 1.0536 1.0447 1.0500 13.3388 1.0565 1.0457 1.0759 1.0389 1.1001 1.0994 1.0992 1.0998 1.1006
irintensity: 0.1000 0.6094 0.8059 0.4646 0.3122 0.4603 1.8105 4.0167 6.4092 3.0898 13.3876 252.4744 47.6895 41.1365 4.9927 14.3545 22.9855 3.7771 8.3402 9.7546 5.3537 1.3646 3.0132 33.4569 3.8111 11.8997 17.8392 2.2816 14.0241 5.2586 12.1526 12.7625 252.7225 23.6000 25.9714 11.1952 30.2034 12.7992 44.4289 11.1348 61.7343 29.0090
temp: 298.150 k
press: 1.00000 atm
elementType: 8 8 7 6 6 6 6 1 1 1 1 1 1 1 1 1
symmnumber: 1
zpe: 339516.4 jmol-1
zpe.correction: 0.129315 hartree
zpe.thermalcorrener: 0.138232 hartree
zpe.thermalcorrenthalpy: 0.139176 hartree
zpe.thermalcorrgfe: 0.095095 hartree
zpe.sumelectzpe: -362.363074 hartree
zpe.sumelectthermal: -362.354156 hartree
zpe.sumelectthermalent: -362.353212 hartree
zpe.sumelectthermalfe: -362.397293 hartree
dipole: 2.8645 0.7197 1.0162
dipole: 3.1234
quadrupole: -46.2294 -40.8305 -43.4882
quadrupole: -0.6527 -0.8640 0.4941
quadrupole: -2.7134 2.6855 0.0279 -0.6527 -0.8640 0.4941
hfenergy: -362.4923886 hartree
pointgroup: C01 [X(C4H9N1O2)]
dipole: 0.9995762 0.6415987 0.3151089 debye
dipolederiv: -0.9984959 -0.4572993 0.0992193 -0.4437346 -0.6083925 0.0739039 0.5820247 0.3566371 -0.421551 -1.0069829 -0.5894621 0.1715342 -0.6384372 -0.4826355 0.1195439 -0.4835206 -0.3068322 -0.137711 1.4419187 0.9134344 -0.3009724 0.9739619 0.6221172 -0.2130365 -0.2065423 -0.1372166 0.3240414 0.6495665 0.1701732 -0.0091354 0.1858224 0.5080873 -0.0072409 0.2411358 0.1747322 0.2144121 0.0202729 0.0135845 0.0203096 -0.0154674 -0.0157141 0.0171849 -0.0196507 -0.0356599 0.1335677 -0.0674843 0.037672 0.001497 0.0102358 -0.1475257 0.018542 -0.0614911 -0.0118148 0.0755244 0.0029156 0.049497 0.0075604 0.0209347 -0.0613913 0.0168658 0.0176469 0.0162444 0.0806224 0.012318 -0.0180659 0.0318391 -0.0205535 0.0187274 0.0666359 -0.0499757 -0.0122527 -0.1259573 0.0804729 0.0307106 -0.0154923 0.030223 0.0424464 0.0527881 0.0333822 0.0485236 -0.1483807 -0.0902067 -0.1225596 -0.0415209 -0.0826528 -0.0501289 -0.0545541 -0.0707267 -0.0644444 0.0532596 0.108671 -0.0012547 0.0298461 0.0182264 0.0793857 -0.0109189 0.0161116 0.0627113 -0.1266342 -0.0901802 0.1124652 0.0666804 0.071182 0.0237344 -0.0070721 0.0771913 -0.019725 0.074595 -0.0382096 -0.1113811 -0.0881299 -0.1170427 -0.0039679 -0.0299408 -0.0867192 -0.0523863 0.0501687 0.0047065 -0.1322707 -0.0721039 -0.0926777 -0.0096986 -0.0273695 -0.0623574 -0.044166 0.0518686 0.1008449 -0.0078654 0.0278537 0.001283 0.0537877 0.0004421 -0.0068938 0.0500243 -0.1734268 -0.1301275 0.1126217 0.0710148 0.098697 0.0311683 -0.0157738 0.080385 -0.024375 0.0756011 unknown
polarizability: 74.7344088|13.1430394|63.6405944|-3.0001573|-2.3118978|47.9365269 unknown
InChI: InChI=1S/C4H9NO2/c1-3-4(2)7-5-6/h4H,3H2,1-2H3
charge 0 multiplicity 1
16 atoms
O  -0.581711 -0.088191 -0.481232
O  -2.416264 -1.339298 0.04623
N  -1.499641 -0.712663 0.574351
C  0.513282 0.665684 0.205705
C  1.858871 0.082138 -0.271132
C  0.334549 2.154202 -0.12556
C  2.071403 -1.389356 0.137259
H  0.386626 0.48847 1.293667
H  1.917398 0.184837 -1.372096
H  2.664804 0.714277 0.152619
H  0.398048 2.321231 -1.215334
H  -0.645256 2.521167 0.225267
H  1.126664 2.74892 0.365216
H  1.290011 -2.036011 -0.29885
H  2.039613 -1.509647 1.236674
H  3.052103 -1.757259 -0.213786
