program: Gaussian 09
title: 000151013
version: EM64L-G09RevD.01
frameworkgroup: C1[X(C5H11NO2)]
method: RPBEPBE
basis: SDD
operation: Freq
keyword: #p
keyword: freq=noraman
keyword: PBEPBE/SDD
title: #p freq=noraman PBEPBE/SDD
converged: YES YES NO NO
title: Mulliken charges:
elementType: O O N C C C C C H H H H H H H H H H H
charge: -0.265882 -0.246625 -0.614512 -0.141003 -0.365267 -0.686169 0.222670 -0.504111 0.233600 0.216612 0.209001 0.201650 0.216267 0.227393 0.273595 0.302916 0.233640 0.245366 0.240858
chargesum: 0.00000
title: Mulliken charges with hydrogens summed into heavy atoms:
elementType: O O N C C C C C
charge: -0.265882 -0.246625 -0.038001 0.092597 0.060346 -0.040858 0.222670 0.215753
polarizability: 8.24224338e+01 1.51196750e+00 6.75064244e+01 -1.32356571e+00 3.59158151e+00 5.35908177e+01
1716.lowfreq: -11.3626 -5.7176 -0.0010 -0.0006 0.0004 4.2981 45.8049 82.2641 84.0418
frequency: 45.5922 82.1510 84.0131 116.4630 192.3420 224.0901 233.4377 253.6552 307.4974 337.6071 356.0864 488.2229 514.7572 637.6605 704.4307 765.5915 828.5264 870.0886 946.4710 1003.8624 1060.0254 1075.0463 1113.4022 1122.0492 1138.8161 1150.3315 1196.2490 1259.7536 1292.6194 1319.3706 1369.2580 1387.4550 1423.8572 1451.8412 1458.1774 1464.9400 1474.8742 1485.2286 1598.3665 1652.0507 2972.7060 2980.7158 2995.8649 3005.4504 3040.2710 3069.8668 3076.4129 3107.4923 3150.9528 3484.6980 3628.3322
redmass: 3.8065 1.7363 1.1785 3.1555 1.9477 1.8766 1.4793 1.5839 3.4378 4.5665 2.5965 1.9344 1.7676 4.1680 6.1314 1.4774 2.5476 2.4055 5.2688 1.6208 2.6087 2.1178 1.2689 1.4845 2.7441 1.4684 2.4202 1.2932 1.3462 1.2724 1.5591 1.2351 1.2089 1.0501 1.0795 1.0509 1.0496 1.0491 1.4338 3.1107 1.0358 1.0612 1.0826 1.0296 1.1011 1.1010 1.0992 1.1046 1.1049 1.0449 1.0989
irintensity: 1.9525 0.0971 0.4629 2.5891 14.7519 8.9178 15.9521 39.5705 2.1527 9.9007 15.4103 75.4024 232.6735 5.2937 11.6395 10.0660 3.6108 14.8095 10.5389 6.2396 3.1627 6.6933 1.2681 66.6745 208.5031 18.7274 27.8494 3.9934 29.5856 2.0380 4.9679 12.9789 20.1107 14.2576 5.3247 11.8556 12.6533 11.0157 174.6500 82.9785 40.2623 18.4521 25.3062 31.2909 5.6338 69.4827 40.6127 26.4390 15.6882 9.5514 9.4238
temp: 298.150 k
press: 1.00000 atm
elementType: 8 8 7 6 6 6 6 6 1 1 1 1 1 1 1 1 1 1 1
symmnumber: 1
zpe: 418687.1 jmol-1
zpe.correction: 0.159470 hartree
zpe.thermalcorrener: 0.169867 hartree
zpe.thermalcorrenthalpy: 0.170811 hartree
zpe.thermalcorrgfe: 0.123493 hartree
zpe.sumelectzpe: -401.658805 hartree
zpe.sumelectthermal: -401.648408 hartree
zpe.sumelectthermalent: -401.647463 hartree
zpe.sumelectthermalfe: -401.694782 hartree
dipole: 0.4609 -2.0517 0.3632
dipole: 2.1340
quadrupole: -38.9820 -52.1448 -51.3854
quadrupole: 4.8601 1.3375 0.0176
quadrupole: 8.5221 -4.6407 -3.8814 4.8601 1.3375 0.0176
hfenergy: -401.8182746 hartree
pointgroup: C01 [X(C5H11N1O2)]
dipole: -0.1943525 0.8117296 0.090639 debye
dipolederiv: -1.0673198 -0.376557 0.1002631 -0.536408 -0.7409694 0.2212746 0.1537345 0.2262454 -0.409916 -0.6477787 0.1658845 -0.1544838 -0.1229952 -0.7277857 0.2278897 -0.0290853 0.3708082 -0.5207072 -0.3980856 -0.0500122 0.149759 0.044533 -0.8028591 -0.2200814 0.1104591 -0.3069388 -0.5767392 -0.1326878 0.1892146 -0.1059779 0.2103796 0.5470868 0.1102166 -0.1039834 0.024143 0.2959742 0.0158943 0.017779 -0.0064063 -0.1283841 -0.0020376 -0.0727767 -0.1037866 -0.0800881 0.0690749 -0.0530077 0.0297115 -0.017643 0.1055006 0.0468379 -0.0258009 0.0484815 -0.0444292 0.0709272 1.2792932 0.0911726 0.0732813 0.5349634 1.0502321 -0.4989335 -0.0636301 -0.6411133 0.5583886 0.5980908 0.1358692 -0.0210063 0.0791499 0.2742086 0.0196898 0.0377706 0.0504502 0.2522936 0.066507 -0.0071035 -0.0058621 -0.0330545 -0.0369724 0.0590713 0.0170499 0.073579 -0.1175109 -0.0057129 -0.0858191 0.0079408 -0.0972975 -0.1379393 -0.0159999 -0.0009831 0.020591 0.0762443 0.026781 0.038623 -0.0283206 0.0281251 0.051725 0.0817363 -0.0124806 0.0307894 -0.1512164 0.0086733 -0.0936138 -0.0058664 -0.1774065 -0.0988353 0.0322673 -0.0069656 0.0330523 0.0816545 0.0638926 -0.0065598 0.0071006 0.0037055 0.0781582 0.0566464 -0.0598283 0.0796225 -0.157062 -0.0255186 0.0956465 0.051582 0.1217355 -0.0364401 -0.0962046 0.0671004 -0.1000623 0.0251287 0.0088101 -0.0492435 -0.0542232 -0.0056065 0.2578506 0.0831925 0.0147949 0.153135 0.3244786 0.2775587 -0.0217922 -0.0571896 -0.0443143 0.2550588 0.0386271 -0.0430465 0.14596 0.1469918 0.0362202 -0.0545633 0.0160085 -0.1010016 -0.0387678 0.0816013 0.0405089 0.0916083 0.069175 -0.0463392 0.0111283 0.0241486 0.1160396 -0.036839 -0.0721929 0.0014339 -0.066555 0.0744828 -0.0052707 -0.0297646 0.0268952 0.0023361 0.0982877 -0.0102228 -0.0675441 -0.0607977 -0.1116623 unknown
polarizability: 82.3618059|1.8463231|67.0466308|1.3653494|-4.4235265|54.1112392 unknown
InChI: InChI=1S/C5H11NO2/c1-3-4(6)5(7)8-2/h4H,3,6H2,1-2H3
charge 0 multiplicity 1
19 atoms
O  1.446777 0.778709 -0.467218
O  1.211667 -1.132242 0.843202
N  -1.275641 -1.594097 -0.300775
C  -0.740412 -0.232603 -0.382589
C  -1.484122 0.848118 0.485453
C  -2.958593 1.013901 0.064703
C  0.718885 -0.283284 0.064082
C  2.866589 0.859903 -0.04192
H  -0.760518 0.121668 -1.431743
H  -0.954517 1.814167 0.374855
H  -1.422873 0.551453 1.551255
H  -3.529868 0.076537 0.203639
H  -3.039123 1.310886 -0.998118
H  -3.455445 1.79202 0.671675
H  -2.282165 -1.68358 -0.443527
H  -0.89661 -2.146435 0.473387
H  3.257335 1.75711 -0.541451
H  3.41012 -0.044255 -0.363082
H  2.933314 0.951223 1.055272
