program: Gaussian 09
title: 000151009
version: EM64L-G09RevD.01
frameworkgroup: C1[X(C7H14O6)]
method: RPBEPBE
basis: SDD
operation: Freq
keyword: #pfreq=noraman
keyword: PBEPBE/SDD
title: #p freq=noraman PBEPBE/SDD
converged: YES YES NO NO
title: Mulliken charges:
elementType: O O O O O O C C C C C C C H H H H H H H H H H H H H H
charge: -0.448945 -0.426128 -0.444479 -0.304737 -0.453070 -0.214996 -0.148668 -0.113196 -0.148531 -0.160193 -0.305800 -0.062844 -0.483166 0.277567 0.300500 0.233708 0.250841 0.207131 0.221786 0.336604 0.319874 0.363890 0.179560 0.362440 0.208181 0.238810 0.213861
chargesum: 0.00000
title: Mulliken charges with hydrogens summed into heavy atoms:
elementType: O O O O O O C C C C C C C
charge: -0.112341 -0.106254 -0.080589 -0.304737 -0.090630 -0.214996 0.128900 0.187304 0.085177 0.090648 0.123117 0.116716 0.177686
polarizability: 1.01774914e+02 1.01374390e+00 9.81679382e+01 3.95756349e+00 1.93632063e+00 8.85649753e+01
1716.lowfreq: -12.4206 -8.1471 -1.4256 0.0002 0.0007 0.0009 33.9081 45.1701 57.5065
frequency: 33.7419 45.0090 57.4777 65.2249 99.8760 114.1740 136.6221 164.8754 178.8488 192.2601 218.0696 236.8005 264.1212 281.6243 301.9547 343.5698 383.3186 421.9944 455.8717 498.1525 512.8980 546.1180 578.2948 618.5324 674.0773 717.5600 794.8412 812.5766 865.5559 922.5318 930.6228 942.9299 979.3740 1009.1386 1040.8281 1060.6692 1079.0968 1081.9927 1096.5205 1119.5540 1145.7649 1172.4404 1196.5116 1207.4353 1233.7223 1255.4925 1257.9962 1281.2288 1324.1548 1337.5900 1346.3778 1362.7144 1363.8983 1370.8082 1383.2459 1396.3923 1438.2206 1460.3733 1460.6904 1479.0740 1605.1258 2940.3570 2942.8238 2950.9460 2964.7131 3008.6322 3013.5363 3022.0577 3077.1396 3092.1415 3111.7650 3403.6308 3486.8460 3497.7323 3516.7132
redmass: 5.3088 4.7416 4.6067 4.5958 2.9914 3.9930 1.4496 3.7452 4.2414 3.9320 1.5638 3.0939 3.1935 4.1296 5.4972 3.5453 3.5499 3.8750 4.5739 1.1798 1.1289 1.6711 1.5337 3.4220 4.2711 3.4588 3.9810 2.9051 3.4305 2.9813 2.8607 2.9084 2.4293 3.6651 3.2786 2.8696 2.6781 2.5100 2.3478 1.3264 1.3887 1.1657 1.3025 1.3083 1.3272 1.4742 1.4889 1.2893 1.3209 1.3084 1.2276 1.1975 1.3286 1.2697 1.3635 1.3350 1.1332 1.0616 1.0645 1.0644 8.2720 1.0360 1.0810 1.0526 1.0882 1.1051 1.0867 1.1035 1.0862 1.0865 1.0986 1.0644 1.0648 1.0647 1.0660
irintensity: 1.4239 1.6609 4.6384 1.0927 12.5414 0.5469 228.1272 15.1927 15.8426 4.6610 6.9764 12.5037 6.1877 8.2874 28.7698 12.6987 31.2482 1.5371 2.3189 250.6841 85.8714 11.2517 24.0462 15.3840 7.2159 21.9766 13.6174 9.9911 56.5446 27.8195 41.6711 26.2552 20.7378 24.4817 94.5911 116.3484 66.0018 17.8142 33.5389 7.4605 13.5372 25.4506 46.5928 35.6237 9.4833 9.3358 14.7628 6.0185 60.1742 14.3994 16.4037 13.9787 0.6468 2.1359 39.7100 42.2735 0.6492 16.5226 16.4980 11.1228 121.4571 62.4669 12.8158 61.8393 77.1043 51.8938 34.7481 48.0099 4.9002 1.8809 22.3166 32.8977 36.6119 3.6040 4.0171
temp: 298.150 k
press: 1.00000 atm
elementType: 8 8 8 8 8 8 6 6 6 6 6 6 6 1 1 1 1 1 1 1 1 1 1 1 1 1 1
symmnumber: 1
zpe: 562158.7 jmol-1
zpe.correction: 0.214115 hartree
zpe.thermalcorrener: 0.229793 hartree
zpe.thermalcorrenthalpy: 0.230737 hartree
zpe.thermalcorrgfe: 0.170316 hartree
zpe.sumelectzpe: -725.344655 hartree
zpe.sumelectthermal: -725.328977 hartree
zpe.sumelectthermalent: -725.328032 hartree
zpe.sumelectthermalfe: -725.388454 hartree
dipole: 3.2190 -0.4825 -3.2179
dipole: 4.5771
quadrupole: -64.5428 -86.8511 -79.1111
quadrupole: 8.6879 -2.0901 9.4562
quadrupole: 12.2922 -10.0161 -2.2761 8.6879 -2.0901 9.4562
hfenergy: -725.5587699 hartree
pointgroup: C01 [X(C7H14O6)]
dipole: -1.2755143 -0.3058985 -1.2337973 debye
polarizability: 101.6568473|-0.1769263|95.8381974|-4.0407269|-4.7218554|91.0127828 unknown
InChI: InChI=1S/C7H14O6/c1-13-3-5(10)7(12)6(11)4(9)2-8/h2,4-7,9-12H,3H2,1H3
charge 0 multiplicity 1
27 atoms
O  0.221057 -0.403863 -1.669023
O  1.54385 1.961074 -1.082016
O  -1.642966 1.673839 0.886879
O  -2.743182 -0.767773 0.562265
O  1.913737 -0.292419 1.882998
O  2.983233 -1.939238 0.049749
C  -0.066566 0.215664 -0.345779
C  1.113073 1.128567 0.04923
C  -1.418152 0.97602 -0.380596
C  2.31551 0.316493 0.630225
C  -2.59999 0.032646 -0.662401
C  2.868083 -0.741513 -0.320449
C  -3.88734 -1.676474 0.526819
H  -0.139596 -0.62637 0.362301
H  0.779685 1.833187 0.82719
H  -1.368702 1.772146 -1.150105
H  3.132135 1.052644 0.804937
H  -2.396985 -0.622635 -1.535327
H  -3.523676 0.622388 -0.841713
H  -0.107772 0.207093 -2.380097
H  1.728878 1.34768 -1.84275
H  -2.009266 0.990878 1.513008
H  3.205387 -0.408353 -1.326694
H  2.165031 -1.259469 1.829056
H  -4.83937 -1.120955 0.395475
H  -3.896167 -2.199988 1.495188
H  -3.782929 -2.417471 -0.29187
