program: Gaussian 09
title: 000151001
version: EM64L-G09RevD.01
frameworkgroup: C1[X(C9H12N2O2)]
method: RPBEPBE
basis: SDD
operation: Freq
keyword: #p
keyword: freq=noraman
keyword: PBEPBE/SDD
title: #p freq=noraman PBEPBE/SDD
converged: NO YES NO NO
title: Mulliken charges:
elementType: O O N N C C C C C C C C C H H H H H H H H H H H H
charge: -0.414287 -0.253246 -0.552727 -0.697699 -0.587281 -0.202683 0.498076 -0.387383 -0.403663 0.187225 -0.423219 -0.413581 0.486312 0.236033 0.220897 0.267447 0.249819 0.226730 0.213569 0.211658 0.282896 0.279990 0.301582 0.302384 0.371153
chargesum: 0.00000
title: Mulliken charges with hydrogens summed into heavy atoms:
elementType: O O N N C C C C C C C C C
charge: -0.043134 -0.253246 0.010159 -0.093733 -0.130350 0.064763 0.498076 -0.137564 -0.176933 0.187225 -0.209650 -0.201924 0.486312
polarizability: 1.52474686e+02 1.70831167e+01 1.09991239e+02 1.38472737e+01 -1.22402194e+01 9.03171182e+01
1716.lowfreq: -2.5255 0.0004 0.0008 0.0009 6.0934 11.6389 21.7579 38.1213 61.1969
frequency: 21.5534 38.0741 61.1955 73.6265 144.1878 213.0369 242.0039 270.7062 299.1772 321.4062 325.7616 355.5928 362.3682 394.3676 411.2627 458.4557 511.2945 543.4619 586.8293 607.1513 637.3923 640.5404 707.1465 721.4242 780.2557 781.9960 817.4924 825.3548 837.4875 937.4387 950.1830 958.4535 987.0065 1003.3568 1019.4957 1045.4262 1093.8378 1117.6541 1144.9864 1192.2890 1204.6187 1224.9011 1243.4364 1311.3736 1316.7693 1325.9571 1341.5456 1363.2162 1386.6655 1435.9667 1463.5697 1521.2065 1581.7836 1632.5040 1638.1014 1643.8384 1647.2363 2994.9240 3054.5239 3071.1941 3105.8691 3113.4256 3130.2422 3140.9750 3448.2574 3494.6075 3568.8578 3579.3759 3709.4895
redmass: 6.3682 4.6066 6.5100 4.0014 5.1172 4.4827 3.1029 3.0617 1.9171 1.3583 1.4449 5.0112 1.0441 2.4460 2.7184 4.0794 3.2378 2.9664 3.0804 1.2672 1.6914 4.5042 3.9348 3.2299 3.6940 3.5866 1.3170 2.1555 3.5356 1.4412 1.7281 1.3712 2.6702 2.8216 1.4517 2.2178 3.0633 1.3402 1.1958 1.1008 1.4411 2.3127 1.5671 2.1613 1.7647 1.3820 1.5369 1.3941 4.8819 3.1729 1.1019 3.0744 6.6085 1.7770 1.1056 2.1965 7.3397 1.0604 1.0944 1.0935 1.0866 1.0875 1.0962 1.0967 1.0445 1.0638 1.0447 1.0983 1.1040
irintensity: 2.1208 0.4162 1.7238 2.0712 1.2312 2.2503 9.3232 12.4238 6.5448 136.3122 210.6067 5.7794 1.5239 0.5373 0.0935 22.0108 43.3316 32.4176 6.3173 205.1211 142.9764 25.7881 42.8851 0.2873 8.3853 7.8564 2.7373 40.8035 24.8216 2.6258 9.3867 0.4651 50.8561 2.2896 2.3250 213.1065 27.6012 10.6116 10.5589 20.5172 6.9610 0.3586 4.6403 44.5602 25.3359 5.3815 4.6555 11.0298 7.7529 0.0445 12.4886 131.9777 3.0386 2.8588 43.3076 277.9983 166.7413 27.0244 4.4327 19.1054 14.7685 24.5963 36.2302 4.4112 2.4166 13.9489 64.8795 3.6481 19.2493
temp: 298.150 k
press: 1.00000 atm
elementType: 8 8 7 7 6 6 6 6 6 6 6 6 6 1 1 1 1 1 1 1 1 1 1 1 1
symmnumber: 1
zpe: 527165.3 jmol-1
zpe.correction: 0.200787 hartree
zpe.thermalcorrener: 0.214004 hartree
zpe.thermalcorrenthalpy: 0.214948 hartree
zpe.thermalcorrgfe: 0.159790 hartree
zpe.sumelectzpe: -609.144940 hartree
zpe.sumelectthermal: -609.131722 hartree
zpe.sumelectthermalent: -609.130778 hartree
zpe.sumelectthermalfe: -609.185937 hartree
dipole: 1.4793 0.8210 1.6310
dipole: 2.3500
quadrupole: -53.9878 -74.3893 -78.4527
quadrupole: 3.0477 1.1887 0.2336
quadrupole: 14.9555 -5.4460 -9.5095 3.0477 1.1887 0.2336
hfenergy: -609.3457267 hartree
pointgroup: C01 [X(C9H12N2O2)]
dipole: -0.5998031 0.3753464 -0.5951396 debye
dipolederiv: -0.3913 -0.0152006 0.0559406 -0.0564967 -0.4455266 0.4624527 0.0850055 0.408939 -1.0014539 -0.3885054 -0.1321289 -0.0974552 -0.076411 -0.7061189 -0.2481812 0.1087658 -0.0665908 -0.8390017 -0.6462736 0.0951256 0.009307 0.1690064 -0.8740276 -0.0003365 0.0807759 0.0022163 -0.167286 -1.5142637 0.3135895 -0.0100773 0.3656184 -0.4460281 0.3491829 -0.04957 0.3547415 -0.5071681 0.063025 0.0053604 0.0294636 -0.0461063 0.0791026 0.0192819 0.1088597 -0.0425019 0.1254684 0.4887718 -0.0054469 -0.0009079 -0.0053713 0.2260239 0.0205342 -0.0825224 0.0347452 0.1047034 0.0425 -0.04225 -0.0086459 -0.1048696 -0.1995404 -0.0602139 0.0044249 -0.0458448 -0.1922592 0.1153704 -0.158132 -0.0143204 -0.0348457 0.0999304 0.1398571 0.0670288 0.0815484 -0.0449125 0.1571351 0.0482146 0.1597684 -0.0631247 0.0446659 0.08933 0.0900773 0.1483982 -0.003667 0.1629717 0.1190849 0.0497683 0.2404641 1.016328 -0.1355734 -0.1228224 -0.2533633 1.4187044 -0.4314569 0.1466681 0.0590541 -0.2116251 0.0023118 0.1006779 -0.2229444 0.2305766 -0.1344095 -0.3340181 -0.0017855 -0.0129023 0.392956 -0.1404443 0.1944677 0.2434957 0.059786 -0.095524 1.5000568 -0.4667933 0.165771 -0.5244627 0.1923753 -0.1537297 0.1950021 -0.1591792 0.0982927 0.0175887 -0.0036453 -0.0042664 0.0329169 -0.1210991 0.0196323 0.013381 -0.0095575 0.0764854 -0.0203969 0.0206689 -0.0626904 -0.0237835 0.076841 -0.0832375 -0.0790009 -0.0066482 -0.0776036 0.041008 -0.0055521 -0.0508446 0.0086775 0.0371145 -0.0279916 -0.0734445 -0.0212174 -0.0655885 0.0427596 -0.0470351 -0.1002414 -0.0477101 0.0632197 -0.060498 -0.1004028 -0.0632019 0.0654205 0.0766881 0.0876751 0.0231371 0.0781455 -0.0462887 -0.097837 0.0199805 -0.0930961 0.0742129 0.0270293 0.0957583 0.020205 0.1015442 -0.0430172 -0.1195483 0.0094494 -0.1113359 0.0855595 -0.0452777 -0.0544932 -0.1167371 -0.0399515 0.0573881 -0.0926622 -0.1198343 -0.097214 0.0530729 0.0357588 -0.0073366 0.0565595 -0.1092934 0.3202008 0.117942 0.0318991 0.0815055 0.1146209 0.1683316 0.008401 -0.0210673 -0.0362277 0.2988904 -0.1375169 -0.0556022 -0.0759756 0.0824592 0.2265512 0.0287443 -0.0505325 0.0391935 0.197587 -0.1226514 -0.0411456 -0.1250478 0.2763886 0.2156074 0.0150935 -0.0637099 0.0024303 0.2111111 -0.1209561 -0.0723506 -0.1185294 0.2726589 0.390339 -0.0445846 -0.0145762 -0.0506737 0.0990004 -0.0524251 -0.0385056 -0.1131531 0.2808265 unknown
polarizability: 152.5729395|-18.392005|109.4483502|10.421648|13.8148053|90.7617536 unknown
InChI: InChI=1S/C9H12N2O2/c10-7-3-1-6(2-4-7)5-8(11)9(12)13/h1-4,8,12H,5,10-11H2
charge 0 multiplicity 1
25 atoms
O  2.280131 1.400601 -1.608069
O  2.430116 1.473269 0.709262
N  3.43371 -1.365509 -0.248871
N  -4.282963 0.688574 -0.218269
C  1.11328 -1.241536 0.6363
C  2.113871 -0.723321 -0.430352
C  -0.307985 -0.739988 0.429456
C  -0.782494 0.431589 1.074568
C  -1.202716 -1.420179 -0.436884
C  2.258424 0.805382 -0.337858
C  -2.091184 0.909571 0.866115
C  -2.514353 -0.956877 -0.658365
C  -2.981752 0.222195 -0.008104
H  1.157069 -2.344534 0.583564
H  1.486535 -0.936838 1.633316
H  1.742223 -0.972528 -1.437952
H  -0.113118 0.977777 1.750357
H  -0.869723 -2.336566 -0.941722
H  -2.430593 1.816352 1.382684
H  -3.185356 -1.508134 -1.329351
H  4.091723 -1.210601 -1.019544
H  3.854607 -1.181904 0.668907
H  -4.918147 0.198064 -0.840175
H  -4.615925 1.527347 0.2470
H  2.421317 2.382394 -1.510311
