program: Gaussian 09
title: 000150994
version: EM64L-G09RevD.01
frameworkgroup: C1[X(C12H15N)]
method: RPBEPBE
basis: SDD
operation: Freq
keyword: #pfreq=noraman
keyword: PBEPBE/SDD
title: #p freq=noraman PBEPBE/SDD
converged: YES YES NO NO
title: Mulliken charges:
elementType: N C C C C C C C C C C C C H H H H H H H H H H H H H H H
charge: -0.120507 -0.140215 0.456028 -0.763140 -0.428815 -0.646212 -0.379979 -0.456670 -0.232518 -0.222965 -0.245660 0.197492 -0.501228 0.186835 0.244006 0.218952 0.235324 0.203375 0.257069 0.254171 0.248440 0.184571 0.269185 0.232406 0.224223 0.223401 0.226527 0.275905
chargesum: 0.00000
title: Mulliken charges with hydrogens summed into heavy atoms:
elementType: N C C C C C C C C C C C C
charge: -0.120507 0.046619 0.456028 -0.064858 0.031628 0.040970 -0.110794 -0.224264 -0.008295 0.000436 -0.019133 0.197492 -0.225324
polarizability: 1.76313569e+02 3.29431782e+00 1.15802646e+02 8.54506400e+00 1.50280809e+01 9.86349205e+01
1716.lowfreq: -10.0344 -3.1610 -0.0007 -0.0003 -0.0002 8.0097 37.3141 52.9076 87.1002
frequency: 37.2012 52.8985 87.0986 90.8739 151.0346 186.1754 217.9658 246.1377 274.6548 282.4376 311.6166 324.5787 346.4996 383.0373 407.0336 457.3648 536.7346 568.7414 608.1255 617.9856 628.0361 660.0828 709.0077 754.7431 773.2341 798.9357 859.1171 922.1366 928.1195 951.2108 980.2574 981.6041 990.1590 998.2046 1018.9179 1027.3957 1059.3651 1075.8494 1088.8739 1117.9430 1144.1933 1170.2921 1180.6796 1199.0369 1219.2536 1258.2013 1290.2159 1311.8729 1333.0897 1356.5044 1383.7929 1387.3456 1430.7824 1441.6918 1455.5853 1473.2401 1475.9081 1477.4867 1482.3381 1487.6300 1594.0030 1612.4380 2144.7979 2815.8981 2824.8676 2868.2298 2986.0504 3048.0745 3051.5878 3083.0968 3092.7556 3108.5884 3111.1150 3123.1446 3135.6583 3147.2422 3161.5606 3427.6833
redmass: 4.2019 3.9607 2.6020 3.7327 3.6059 3.2931 1.1803 1.6610 2.7722 2.5764 2.9829 2.4911 2.1473 3.1866 2.8457 3.4073 3.2979 3.6597 4.1011 5.8146 1.2301 1.2462 1.7285 2.9536 2.0611 3.3702 1.2487 2.3235 1.5582 2.1420 2.0290 1.3912 4.9410 1.3462 2.1945 1.8539 1.8416 2.0729 1.5610 1.5310 2.8918 1.0558 1.1112 2.2449 1.8592 1.3116 1.7143 1.3155 1.3125 1.4687 1.8804 2.0714 1.2143 2.0017 1.0769 1.2057 1.1050 1.0643 1.5771 1.0813 6.1526 6.1620 6.0237 1.0785 1.0731 1.0571 1.0357 1.0830 1.0726 1.0998 1.0991 1.1012 1.0871 1.0861 1.0914 1.0954 1.1013 1.1594
irintensity: 0.1267 0.0259 1.0240 0.7589 0.7070 0.6107 0.6486 1.0963 0.4990 0.3260 1.1161 6.0595 4.7779 3.6639 0.1325 1.0140 11.5447 6.4132 2.1015 0.2172 75.4092 63.0928 54.9246 6.2569 42.1264 18.3943 0.0459 8.3475 11.0763 10.2537 11.0146 0.1095 1.3735 3.0630 7.7099 22.6787 7.8695 58.2625 2.7967 8.5211 17.6035 0.1742 1.7029 2.4978 26.2746 10.3048 18.5737 19.2973 9.3352 4.0791 8.9707 13.6970 11.7605 14.6507 2.7773 0.4036 11.8736 15.0445 13.3974 13.0348 0.8845 6.0847 2.4290 33.0079 121.4884 125.5217 25.3207 13.8380 20.7551 47.5142 22.3920 21.2233 9.3099 0.2312 20.6266 30.1035 27.0341 65.2799
temp: 298.150 k
press: 1.00000 atm
elementType: 7 6 6 6 6 6 6 6 6 6 6 6 6 1 1 1 1 1 1 1 1 1 1 1 1 1 1 1
symmnumber: 1
zpe: 614924.3 jmol-1
zpe.correction: 0.234212 hartree
zpe.thermalcorrener: 0.247510 hartree
zpe.thermalcorrenthalpy: 0.248454 hartree
zpe.thermalcorrgfe: 0.194223 hartree
zpe.sumelectzpe: -519.972489 hartree
zpe.sumelectthermal: -519.959192 hartree
zpe.sumelectthermalent: -519.958248 hartree
zpe.sumelectthermalfe: -520.012478 hartree
dipole: 0.1887 0.9319 0.6181
dipole: 1.1341
quadrupole: -74.0905 -74.5443 -78.3204
quadrupole: -0.3968 0.8096 2.8548
quadrupole: 1.5612 1.1074 -2.6687 -0.3968 0.8096 2.8548
hfenergy: -520.2067017 hartree
pointgroup: C01 [X(C12H15N1)]
dipole: 0.075292 -0.3715649 -0.2352689 debye
polarizability: 176.460541|-3.8707827|116.4046109|-7.550546|14.6798085|97.8859841 unknown
InChI: InChI=1S/C12H15N/c1-4-10-13(3)11(2)12-8-6-5-7-9-12/h1,5-9,11H,10H2,2-3H3
charge 0 multiplicity 1
28 atoms
N  -1.345053 -0.02694 -0.170931
C  -0.247475 -1.045189 -0.162115
C  1.116167 -0.349689 -0.065616
C  -0.380519 -2.04722 1.014449
C  -2.700991 -0.627406 -0.031028
C  -1.265012 0.850494 -1.364287
C  1.320841 0.702647 0.862544
C  2.208033 -0.795165 -0.849117
C  2.594372 1.295619 1.003826
C  3.485824 -0.205447 -0.707502
C  3.683267 0.841821 0.22138
C  -3.774057 0.379772 0.079707
C  -4.706247 1.180474 0.17494
H  -0.262141 -1.638456 -1.115581
H  0.542089 -2.648435 1.085207
H  -1.223732 -2.748597 0.885055
H  -0.505484 -1.504223 1.968705
H  -2.947687 -1.305624 -0.890922
H  -2.721831 -1.245844 0.882862
H  -0.284643 1.351849 -1.389561
H  -2.050382 1.621511 -1.304586
H  -1.396136 0.286876 -2.322216
H  0.464752 1.059796 1.44597
H  2.057299 -1.603434 -1.576404
H  2.739654 2.11174 1.721121
H  4.321588 -0.557419 -1.323151
H  4.6718 1.302149 0.331135
H  -5.511195 1.886938 0.262319
