program: Gaussian 09
title: 000150992
version: EM64L-G09RevD.01
frameworkgroup: C1[X(C22H32O5)]
method: RPBEPBE
basis: SDD
operation: Freq
keyword: #pfreq=noraman
keyword: PBEPBE/SDD
title: #p freq=noraman PBEPBE/SDD
converged: NO YES NO NO
title: Mulliken charges:
elementType: O O O O O C C C C C C C C C C C C C C C C C C C C C C H H H H H H H H H H H H H H H H H H H H H H H H H H H H H H H H
charge: -0.464905 -0.461639 -0.240526 -0.446843 -0.238248 0.353398 -0.113465 -0.166168 -0.150873 0.131827 -0.605155 -0.611137 -0.148220 -0.132132 0.216594 -0.483791 -0.815893 0.552283 -0.645629 -0.503732 0.051208 -0.749824 -0.828503 -0.555553 -0.584947 0.172713 -0.367108 0.200441 0.233158 0.216108 0.263052 0.190924 0.247078 0.224643 0.282978 0.221667 0.229659 0.221647 0.250621 0.234496 0.218609 0.219305 0.238799 0.199673 0.291619 0.195114 0.239419 0.229659 0.209674 0.255698 0.237867 0.345697 0.342723 0.245759 0.232090 0.252898 0.245782 0.253269 0.366140
chargesum: 0.00000
title: Mulliken charges with hydrogens summed into heavy atoms:
elementType: O O O O O C C C C C C C C C C C C C C C C C C C C C C
charge: -0.119209 -0.118915 -0.240526 -0.080703 -0.238248 0.353398 0.086977 0.066990 0.065234 0.131827 -0.151179 -0.139416 0.134759 0.089535 0.216594 -0.032485 -0.112166 0.552283 -0.187525 -0.012441 0.051208 -0.085631 -0.125264 -0.077704 -0.332049 0.172713 0.131943
polarizability: 3.22248206e+02 1.40760766e+00 2.30626922e+02 -1.71317876e+01 3.97659759e+00 1.91502157e+02
1716.lowfreq: -14.1133 -4.9721 -0.0004 -0.0002 0.0004 3.4333 26.2598 30.3524 40.8863
frequency: 26.0347 29.9916 40.7755 47.4249 58.3282 67.9225 83.1187 103.1672 117.8173 136.7760 151.3504 179.4614 185.7830 197.2903 202.5977 211.5312 222.8330 231.9023 239.1885 260.9718 264.4304 271.8016 280.7210 288.6766 300.0272 305.8015 324.6699 334.9971 339.6513 352.4392 368.8350 372.2090 381.3410 397.3667 409.5046 421.9542 442.9058 456.1478 461.0793 479.2016 495.7340 499.5451 530.0025 531.8934 565.6447 573.7119 602.6743 637.1603 649.6359 673.4385 697.7056 733.8285 749.8415 776.2861 797.3464 832.2049 838.7185 840.3819 880.8324 885.1357 892.0520 907.9555 913.5849 914.3919 922.8296 939.9560 957.4634 963.4205 967.5563 971.8609 994.0244 1000.0480 1015.7766 1020.3325 1024.7375 1031.0597 1040.9095 1058.0093 1068.6507 1071.5197 1088.0470 1108.4166 1113.6880 1114.6293 1118.6366 1124.0858 1129.3140 1134.1531 1159.7269 1168.9716 1171.3166 1178.1159 1180.0233 1185.8021 1195.9773 1219.6565 1230.5825 1234.2872 1242.4459 1245.0969 1257.5888 1265.5853 1280.1495 1282.6087 1286.9627 1291.3207 1304.9535 1310.3472 1315.3908 1319.0090 1326.9951 1330.2677 1333.2588 1342.7705 1345.7698 1349.1332 1354.6253 1372.9873 1379.8436 1380.2194 1393.6033 1395.5903 1412.0672 1428.8486 1441.3294 1459.5525 1463.0507 1466.3344 1466.8505 1471.9900 1472.7782 1481.9489 1484.1724 1484.6663 1488.1837 1490.0157 1583.0465 1598.4695 1621.7579 2893.2417 2942.6795 2950.5460 2951.5219 2954.7499 2965.0503 2973.5710 2973.7497 2976.3976 2980.5060 2981.9047 2987.2255 2994.6977 3000.7739 3017.8561 3018.6258 3037.8903 3043.6372 3043.8301 3053.8216 3057.5146 3064.8480 3072.0601 3083.6831 3084.2979 3085.9225 3103.0809 3104.5936 3115.2296 3432.5218 3542.8430 3593.9405
redmass: 6.6602 2.3381 4.7776 3.8643 1.7022 2.9378 3.5701 3.9261 3.3147 3.6229 4.3089 4.1009 2.1611 2.1800 3.3269 1.5240 2.7528 2.6189 1.6499 2.0470 1.6095 2.0478 2.7451 2.8861 2.5319 1.2034 3.3502 4.8788 2.8019 3.5663 5.2245 2.2835 1.4663 3.5596 3.0809 2.6520 3.8541 3.3178 2.2919 3.3487 3.0744 3.0403 2.8311 3.9685 2.7419 2.9772 3.0276 3.3575 3.7429 3.4544 3.5375 3.1681 4.3009 2.3115 2.4307 2.2155 2.6435 3.3142 1.9697 2.1231 2.2918 2.1979 1.9958 1.7441 1.8146 2.0423 2.0044 2.2667 2.3425 2.2081 2.5159 2.4117 2.2412 2.8067 1.9685 2.4750 2.1382 2.1039 2.2026 2.3818 2.2621 1.8746 2.0646 2.1887 2.3407 1.9849 1.9008 1.9139 2.4320 1.5541 1.3024 1.8991 1.6228 1.8623 1.8233 1.4989 1.4122 1.4589 1.5256 1.4503 1.4536 1.7237 1.9800 1.3884 1.4525 1.3828 1.3864 1.4326 1.4885 1.3922 1.4192 1.3553 1.5132 1.9054 1.7037 1.4281 1.3549 1.3414 1.3577 1.2905 1.4366 1.2017 1.1807 1.0809 1.0775 1.0879 1.0802 1.0529 1.0870 1.0755 1.0791 1.0479 1.0630 1.0706 1.0538 1.0523 10.0591 8.2973 7.5685 1.0799 1.0791 1.0665 1.0744 1.0732 1.0784 1.0450 1.0592 1.0668 1.0595 1.0376 1.0667 1.0612 1.0388 1.0842 1.0987 1.0990 1.0953 1.0957 1.1024 1.0946 1.0965 1.0983 1.0983 1.0998 1.1001 1.0981 1.0917 1.0911 1.0642 1.0658 1.0661
irintensity: 4.8934 63.2528 21.0729 10.9215 102.0650 1.2148 6.1128 1.3320 1.5265 8.0963 5.5418 2.3618 2.1752 2.2083 3.0353 1.6980 0.6378 2.9989 3.9289 5.9174 1.7525 4.2971 3.9093 15.8531 1.8252 95.4107 7.9785 28.4696 4.7096 2.0950 2.0649 19.5154 71.9155 0.7712 14.7819 9.5102 4.7487 2.8273 1.3920 7.6651 12.7490 11.7801 0.3935 12.0990 5.5763 2.0927 2.4395 1.2732 0.1167 8.9385 0.0302 2.9423 0.4779 3.4691 0.2848 5.9562 8.6709 14.9184 3.4658 26.5133 31.8957 15.2638 3.2244 3.0457 11.5959 24.2137 14.2092 34.7926 21.0375 32.2031 17.4533 14.5309 21.6622 103.1131 4.6459 23.4868 13.1758 2.5903 9.1810 3.0849 18.8771 34.4608 19.2885 4.4523 9.0928 6.3148 16.0470 23.9165 0.1023 10.7802 4.2055 4.4429 2.2624 26.4140 8.0793 8.7320 21.8330 9.7766 61.4157 95.3963 40.9367 5.1333 43.0583 14.4377 7.5738 0.5048 4.3679 1.4157 1.7773 7.8447 17.7609 9.4160 3.6744 4.4960 28.6237 3.2052 4.2569 1.8793 35.5820 33.1062 6.6531 12.8665 35.0985 22.2990 19.3160 18.4639 0.3702 13.7290 8.4751 10.4206 9.2467 10.9523 9.3995 4.2837 8.2805 5.4658 164.3571 67.8976 180.1540 18.3472 3.1851 15.2591 24.0733 18.2345 20.7855 2.0130 64.1297 14.1117 27.2144 33.4668 45.7106 24.3782 24.8829 3.2918 14.4129 43.0268 10.4753 41.1550 25.5417 23.7391 43.6736 28.2715 37.6876 14.9600 24.9908 22.5198 9.5354 11.9356 19.5609 7.3541 6.7725
temp: 298.150 k
press: 1.00000 atm
elementType: 8 8 8 8 8 6 6 6 6 6 6 6 6 6 6 6 6 6 6 6 6 6 6 6 6 6 6 1 1 1 1 1 1 1 1 1 1 1 1 1 1 1 1 1 1 1 1 1 1 1 1 1 1 1 1 1 1 1 1
symmnumber: 1
zpe: 1312756.3 jmol-1
zpe.correction: 0.500002 hartree
zpe.thermalcorrener: 0.527395 hartree
zpe.thermalcorrenthalpy: 0.528339 hartree
zpe.thermalcorrgfe: 0.443725 hartree
zpe.sumelectzpe: -1231.540845 hartree
zpe.sumelectthermal: -1231.513452 hartree
zpe.sumelectthermalent: -1231.512508 hartree
zpe.sumelectthermalfe: -1231.597122 hartree
dipole: -2.9724 2.8576 1.7537
dipole: 4.4807
quadrupole: -240.5918 -156.9769 -162.2073
quadrupole: -14.0372 14.4612 -4.3676
quadrupole: -53.9998 29.6151 24.3847 -14.0372 14.4612 -4.3676
hfenergy: -1232.0408476 hartree
pointgroup: C01 [X(C22H32O5)]
dipole: -1.1982468 1.1384803 0.6128832 debye
polarizability: 322.7656961|1.9619924|230.9638588|-14.9276546|1.791799|190.6477307 unknown
InChI: InChI=1S/C22H32O5/c1-12-8-16-15-5-4-13-9-14(24)6-7-20(13,2)19(15)17(25)10-21(16,3)22(12,27)18(26)11-23/h9,12,15-17,19,23,25,27H,4-8,10-11H2,1-3H3
charge 0 multiplicity 1
59 atoms
O  -3.016072 -0.110761 -1.858505
O  0.959546 -2.782459 -0.037462
O  -4.993984 -0.241954 1.09362
O  -5.855036 -2.500415 -0.063365
O  6.8199 0.069488 -0.922159
C  -1.798044 -0.143534 0.359279
C  -0.903388 1.050799 -0.093657
C  0.5214 1.00278 0.498697
C  1.229782 -0.315505 0.015178
C  -3.136456 0.233758 -0.428187
C  -1.106578 -1.450382 -0.078105
C  -1.802242 2.291723 0.127585
C  -3.261467 1.786566 -0.174349
C  0.350645 -1.526542 0.452559
C  2.760428 -0.424367 0.438695
C  1.332862 2.254556 0.111437
C  -2.062995 -0.154437 1.889664
C  3.476029 0.938302 0.298075
C  2.740281 2.187235 0.738191
C  3.478185 -1.451263 -0.498794
C  -4.353668 -0.556935 0.048774
C  -3.960316 2.549113 -1.31913
C  2.887816 -0.870749 1.932132
C  5.010685 -1.480185 -0.334258
C  4.767111 1.046023 -0.156556
C  5.627436 -0.098633 -0.517749
C  -4.79502 -1.784823 -0.741693
H  -0.759203 0.939113 -1.194937
H  0.453566 0.991772 1.607922
H  1.216008 -0.293118 -1.097632
H  -1.087888 -1.520872 -1.181873
H  -1.662146 -2.334424 0.302165
H  -1.719643 2.658447 1.167793
H  -1.525244 3.130917 -0.535573
H  -3.887961 1.892789 0.730259
H  0.325589 -1.561738 1.562617
H  0.810636 3.16424 0.4629
H  1.415175 2.328954 -0.992374
H  -2.659318 0.708547 2.226298
H  -2.620846 -1.062165 2.180305
H  -1.118653 -0.152751 2.459194
H  2.626665 2.179642 1.843981
H  3.333334 3.084583 0.485622
H  3.243093 -1.179365 -1.548079
H  3.050454 -2.450227 -0.330491
H  -3.357774 2.565675 -2.2481
H  -4.942926 2.108547 -1.564065
H  -4.121251 3.600799 -1.021593
H  2.299081 -0.223334 2.608297
H  2.537717 -1.911059 2.050649
H  3.938485 -0.825947 2.268159
H  -2.459062 0.565791 -2.314917
H  0.328366 -3.525035 0.145267
H  5.4782 -2.175372 -1.05439
H  5.291335 -1.845891 0.675096
H  5.2426 2.03308 -0.233949
H  -3.928094 -2.455176 -0.903228
H  -5.121802 -1.448398 -1.746609
H  -6.124334 -1.94692 0.723769
