program: Gaussian 09
title: 000150937
version: EM64L-G09RevD.01
frameworkgroup: C1[X(C14H10O2)]
method: RPBEPBE
basis: SDD
operation: Freq
keyword: #pfreq=noraman
keyword: PBEPBE/SDD
title: #p freq=noraman PBEPBE/SDD
converged: NO YES NO NO
title: Mulliken charges:
elementType: O O C C C C C C C C C C C C C C H H H H H H H H H H
charge: -0.337833 -0.398470 -0.740071 0.451847 0.393768 -0.121335 0.109389 0.070577 -0.430724 0.158214 -0.385175 -0.354368 -0.192364 -0.378859 -0.227730 -0.237917 0.250805 0.250836 0.241251 0.242469 0.288699 0.231053 0.259657 0.233542 0.238281 0.384457
chargesum: 0.00000
title: Mulliken charges with hydrogens summed into heavy atoms:
elementType: O O C C C C C C C C C C C C C C
charge: -0.337833 -0.014013 -0.238430 0.451847 0.393768 -0.121335 0.109389 0.070577 -0.189473 0.158214 -0.142705 -0.065669 0.038689 -0.119202 0.005812 0.000364
polarizability: 2.43751074e+02 3.86294553e+00 1.74628863e+02 -8.94858436e-04 -4.12710768e-03 6.29758174e+01
1716.lowfreq: -16.7547 -0.0011 -0.0006 -0.0002 5.0259 7.8328 42.5671 94.9645 151.9419
frequency: 42.4776 94.9578 151.9417 200.8431 210.8453 213.0303 257.4602 336.9919 354.6868 415.2376 420.1173 448.0318 475.9611 493.3012 505.6037 558.2156 561.8112 587.2581 628.9025 663.7305 664.5606 723.9818 743.9472 775.9059 791.3923 801.4753 835.3628 874.1964 891.5541 915.3221 951.5002 961.4825 980.0063 982.3892 1006.9796 1009.6907 1038.8174 1060.4732 1100.2516 1168.0352 1173.8287 1175.5489 1198.1338 1205.5349 1210.9317 1248.0080 1282.3150 1302.0729 1333.9360 1370.0339 1395.7077 1405.2985 1421.4237 1442.1686 1454.0604 1458.7341 1481.9326 1548.9373 1579.9691 1593.7497 1617.3254 1637.5307 2716.6005 2960.0711 2997.1091 3121.5357 3128.5135 3140.9136 3150.0500 3156.3086 3171.4746 3179.3629
redmass: 3.7885 4.9503 4.5935 2.7033 4.3767 5.1310 5.9150 6.5125 6.0686 11.4224 3.4714 3.0807 4.9867 3.5733 9.1076 3.6151 7.1901 5.3567 6.0402 3.9186 6.2840 2.6064 1.9033 6.1829 1.4562 2.2099 4.9062 1.4390 1.3845 6.5249 2.0998 1.0879 1.3621 1.4245 1.3411 4.4970 2.2147 2.0095 2.3270 2.2364 1.1188 1.2583 1.0995 1.6107 1.8084 1.6489 2.1147 3.3962 2.5562 2.9806 6.6954 6.9508 1.2122 2.2287 3.0911 2.9722 2.5847 3.2165 5.3771 6.1762 6.4558 4.4966 1.0720 1.0608 1.0971 1.0879 1.0876 1.0896 1.0936 1.0937 1.0997 1.0967
irintensity: 0.0005 0.0480 1.8591 6.9187 0.4843 0.0041 0.0052 8.7544 9.3919 5.0970 0.6280 8.7981 6.2354 0.0513 1.7946 1.6898 5.2336 14.7625 1.6093 7.3297 15.5028 34.2985 25.0791 9.0330 51.7726 44.1333 1.6049 11.4194 0.0028 21.2890 0.5546 129.3325 1.9892 9.7863 0.1673 8.8782 7.1853 6.0551 15.3654 6.3649 8.0020 5.9221 0.0152 0.1158 17.1330 60.2342 150.1033 46.3739 91.0153 169.1585 10.6073 4.3692 13.3478 48.0728 110.3688 206.1228 0.9040 12.6659 43.1816 133.1741 16.1960 171.3905 316.5973 5.8968 5.5040 5.0428 6.0812 12.2606 20.4102 11.8535 25.8957 10.8687
temp: 298.150 k
press: 1.00000 atm
elementType: 8 8 6 6 6 6 6 6 6 6 6 6 6 6 6 6 1 1 1 1 1 1 1 1 1 1
symmnumber: 1
zpe: 521319.7 jmol-1
zpe.correction: 0.198560 hartree
zpe.thermalcorrener: 0.210181 hartree
zpe.thermalcorrenthalpy: 0.211125 hartree
zpe.thermalcorrgfe: 0.160721 hartree
zpe.sumelectzpe: -688.881084 hartree
zpe.sumelectthermal: -688.869463 hartree
zpe.sumelectthermalent: -688.868519 hartree
zpe.sumelectthermalfe: -688.918924 hartree
dipole: 2.4610 -4.5999 0.0014
dipole: 5.2169
quadrupole: -80.3295 -89.1780 -96.4870
quadrupole: 5.8113 -0.0011 0.0010
quadrupole: 8.3354 -0.5132 -7.8222 5.8113 -0.0011 0.0010
hfenergy: -689.0796447 hartree
pointgroup: C01 [X(C14H10O2)]
dipole: -0.9432625 1.8228886 0.0005543 debye
dipolederiv: -0.7990044 0.0773956 0.0000305 -0.037662 -1.0941972 0.0000364 -0.0001561 -0.0000498 -0.3548588 -0.5609205 0.0447542 -0.0001473 0.2820869 -1.2000722 0.0001169 -0.0000722 0.0000861 -0.3886171 -0.0133468 0.0084371 0.0000203 0.0614224 -0.1462135 -0.0001746 0.0002349 -0.0005342 0.1250673 0.4980313 -0.1206948 -0.0002108 0.5421744 0.278581 0.0000042 -0.0003834 0.0001946 0.034268 0.215099 0.1964545 0.0001664 -0.1165003 0.1380758 0.0000799 0.0001263 0.0002336 0.0017798 -1.0557315 -0.114493 0.0000132 -0.5866793 -0.5017724 0.0000287 0.0001574 -0.0000411 -0.0596369 -0.7501388 0.2137098 -0.0000331 0.2539383 -0.2027035 -0.0000215 -0.0001289 0.0000002 -0.0202475 1.9521332 0.0285512 0.0000167 0.1783264 1.069797 -0.0000171 0.0000267 0.0000644 0.1678982 -0.8139857 0.0489452 0.0000732 -0.1175775 0.0441363 0.0000504 0.0000951 0.0000181 -0.2317805 0.3806587 0.2225625 0.000029 -0.3810535 1.1274001 -0.00016 0.000033 -0.0002045 0.1268893 -0.2974796 -0.1482497 -0.0000662 -0.1070664 0.1325329 0.0000408 -0.000073 0.0000262 -0.174106 0.1665918 -0.1536738 0.000005 0.126898 0.0566072 0.0000196 0.0000721 0.0000003 -0.0992992 0.3907449 -0.0431812 -0.0000966 -0.2953818 0.2853492 -0.0000029 -0.0000817 -0.0000605 -0.103224 0.08386 -0.3558647 -0.000014 0.0836415 -0.4441105 0.0000004 -0.0001105 0.0001325 -0.2087915 0.0759613 -0.0214744 0.0000636 -0.1029261 0.1158925 0.000015 0.0000385 -0.0000047 -0.1273468 -0.0491609 0.1932741 0.0000549 0.2774144 -0.1074701 0.0000194 0.000046 0.000036 -0.1678031 -0.0335719 -0.00587 -0.0097827 -0.0078881 0.034745 0.08579 -0.011056 0.1041371 0.0091502 -0.0336763 -0.0058892 0.0097796 -0.0079064 0.0350066 -0.0857308 0.0110437 -0.1040015 0.0089027 0.0773514 0.0526508 0.0000143 -0.0022484 -0.1072879 -0.0000022 0.0000096 0.0000024 0.1617608 0.084422 -0.0165196 -0.0000095 0.045184 -0.1093268 -0.0000258 -0.0000087 -0.0000204 0.1496511 0.1441014 0.0445292 -0.000002 -0.0189529 0.0015469 -0.0000182 -0.0000012 -0.0000117 0.1554538 -0.064298 -0.0986547 0.0000465 -0.1158153 0.0332059 0.0000293 0.0000639 0.0000265 0.1491671 -0.0377832 0.0452782 0.0000282 0.0779565 0.0591295 -0.0000053 0.0000279 0.0000179 0.1745694 -0.1020315 0.0735035 -0.0000372 0.0810911 0.0626934 0.0000077 -0.0000347 0.0000099 0.1548242 -0.0725476 -0.0902085 -0.0000426 -0.1038046 0.0207876 -0.0000287 -0.0000524 -0.0000253 0.1611217 0.6147217 -0.0752722 0.0001004 -0.0086715 0.4176672 -0.0000516 0.0001835 -0.000032 0.3552078 unknown
polarizability: 243.8442699|2.9106328|174.5356676|0.0009516|0.0041144|62.9758174 unknown
InChI: InChI=1S/C14H10O2/c15-12-7-3-5-10-8-9-4-1-2-6-11(9)14(16)13(10)12/h1-7,15H,8H2
charge 0 multiplicity 1
26 atoms
O  0.075943 -2.400707 0.00001
O  2.596719 -2.22213 0.000215
C  -0.334873 1.849278 0.00071
C  1.027855 1.179426 0.000234
C  -1.539164 0.927429 0.000236
C  1.140642 -0.245814 0.000216
C  -1.392608 -0.487968 0.000097
C  -0.046245 -1.105332 0.000144
C  2.195588 1.966471 -0.000035
C  2.450675 -0.856958 0.000061
C  -2.845669 1.475242 0.00005
C  -2.53943 -1.328768 -0.000179
C  3.474174 1.352744 -0.000283
C  3.61095 -0.046644 -0.000223
C  -3.980722 0.639609 -0.000235
C  -3.828495 -0.770886 -0.000339
H  -0.401432 2.523847 -0.877978
H  -0.401304 2.522522 0.880448
H  2.115123 3.059285 -0.000044
H  -2.971924 2.564766 0.000138
H  -2.379947 -2.411448 -0.00028
H  4.373102 1.979069 -0.000512
H  4.589619 -0.53373 -0.000369
H  -4.983036 1.081806 -0.000384
H  -4.711247 -1.418507 -0.000551
H  1.637304 -2.623101 0.000755
