program: Gaussian 09
title: 000150923
version: EM64L-G09RevD.01
frameworkgroup: C1[X(C9H9NO)]
method: RPBEPBE
basis: SDD
operation: Freq
keyword: #pfreq=noraman
keyword: PBEPBE/SDD
title: #p freq=noraman PBEPBE/SDD
converged: NO YES NO NO
title: Mulliken charges:
elementType: O N C C C C C C C C C H H H H H H H H H
charge: -0.220488 -0.424692 -0.304458 0.297781 0.250368 0.076357 -0.684014 -0.399734 -0.343938 -0.252923 -0.203490 0.264582 0.320757 0.228680 0.248048 0.215665 0.240016 0.236666 0.227740 0.227078
chargesum: 0.00000
title: Mulliken charges with hydrogens summed into heavy atoms:
elementType: O N C C C C C C C C C
charge: -0.220488 -0.103935 -0.039875 0.297781 0.250368 0.076357 0.008379 -0.159718 -0.107272 -0.025183 0.023588
polarizability: 1.45351946e+02 -1.10748161e+00 1.06153684e+02 -3.24056328e+00 -6.19761645e+00 5.31368661e+01
1716.lowfreq: 0.0007 0.0008 0.0009 3.3242 9.7570 11.2720 81.7647 134.7415 202.3718
frequency: 81.7511 134.7367 202.3694 209.8186 262.4519 292.7865 351.7221 443.8094 478.9018 519.0258 552.6671 590.1016 615.2111 656.7295 694.5270 733.6791 759.1921 780.7341 808.2505 862.0156 869.6655 935.0632 976.6624 1002.9059 1017.7832 1053.6977 1080.0827 1103.2466 1170.1193 1182.0996 1204.4157 1228.0568 1238.4692 1274.0041 1288.5231 1337.7781 1387.2931 1416.1805 1460.5033 1471.2745 1474.5135 1481.5482 1607.7464 1631.7030 1666.4074 2989.0184 2992.0371 3092.7937 3100.1970 3127.3642 3134.6592 3148.9116 3166.2940 3577.1229
redmass: 4.0667 4.3283 1.2454 2.0992 3.8926 5.8582 3.7862 3.2675 8.3536 3.6985 3.7438 2.9779 1.6143 5.4005 3.9032 2.6972 1.5787 2.7454 2.8283 1.3852 4.5001 1.3817 1.3131 2.0568 2.1133 1.6890 2.4463 1.8222 1.0856 1.9612 1.7420 1.6911 1.9378 1.9341 2.2701 1.9434 1.1993 3.3975 2.7197 1.1068 1.5785 1.5341 6.6417 7.2820 9.5365 1.0820 1.0345 1.1009 1.1012 1.0858 1.0898 1.0947 1.1003 1.0795
irintensity: 3.1229 0.1507 0.4381 1.1547 2.8919 3.8044 0.4227 7.5914 3.0951 20.6633 2.1182 14.3222 79.3797 21.4226 12.1054 19.0479 87.1699 8.1088 3.3509 1.5740 1.9948 3.3937 0.0582 12.0290 5.6623 9.7768 0.6847 19.6776 0.7321 52.6107 52.4069 39.5229 5.2482 12.8409 7.4686 32.4822 16.2205 0.1940 39.3787 12.3847 35.4078 44.1921 4.0987 88.6053 416.8270 6.6876 25.7504 21.7417 19.5471 2.4123 7.6355 26.3493 21.9694 36.8842
temp: 298.150 k
press: 1.00000 atm
elementType: 8 7 6 6 6 6 6 6 6 6 6 1 1 1 1 1 1 1 1 1
symmnumber: 1
zpe: 418206.2 jmol-1
zpe.correction: 0.159286 hartree
zpe.thermalcorrener: 0.168266 hartree
zpe.thermalcorrenthalpy: 0.169211 hartree
zpe.thermalcorrgfe: 0.125322 hartree
zpe.sumelectzpe: -477.575384 hartree
zpe.sumelectthermal: -477.566404 hartree
zpe.sumelectthermalent: -477.565459 hartree
zpe.sumelectthermalfe: -477.609348 hartree
dipole: -3.1830 0.3201 0.2256
dipole: 3.2070
quadrupole: -73.8445 -53.8403 -66.5782
quadrupole: 4.8362 0.1061 -2.5611
quadrupole: -9.0901 10.9140 -1.8239 4.8362 0.1061 -2.5611
hfenergy: -477.73467 hartree
pointgroup: C01 [X(C9H9N1O1)]
dipole: -1.2563429 -0.0852115 -0.079573 debye
dipolederiv: -1.4784848 -0.1460174 -0.0487706 -0.2244352 -0.5021039 -0.006966 -0.0120941 0.0131264 -0.3595083 -1.4931809 -0.1129882 -0.0295741 0.3890186 -0.4069955 -0.0008081 -0.1095485 0.0048665 -0.3349187 -0.0231395 -0.0889031 0.0285146 -0.0546586 -0.2657933 0.0100661 0.0586607 0.0222675 0.1450937 0.064986 -0.0595567 0.0125096 -0.3767405 -0.1515688 -0.0265083 0.1172696 -0.0375472 -0.0943727 0.9859717 0.3514753 -0.0023501 0.6211092 0.140969 0.0163925 -0.0663165 0.0132283 0.0904766 1.9505273 0.0794488 0.0936599 -0.4379135 0.7606474 -0.0779992 0.143717 -0.131505 0.1686087 -0.0028138 -0.0184041 0.0137945 -0.0307488 0.1056615 -0.0304097 -0.0328957 0.0349263 0.0751003 0.0938697 -0.0069982 0.0191802 0.0558114 0.1271291 -0.0408138 -0.0018194 -0.0388752 -0.1296258 -0.2710832 -0.1391775 0.0232891 0.0260765 0.0532517 -0.0429306 -0.011394 -0.0440869 -0.1890742 -0.1053072 0.0576612 -0.0014403 0.1164561 -0.0917653 -0.0107614 -0.0127391 -0.0107 -0.1875573 0.1069963 0.0415638 0.0121497 -0.0830384 0.0725342 -0.0412909 0.027722 -0.0345567 -0.1447198 0.0170038 0.0114518 -0.03832 -0.0040375 0.0802701 0.0336917 -0.0426635 0.0267455 -0.056979 0.1234906 0.0293037 -0.0111389 0.0191827 0.1711034 0.0278688 -0.0144823 0.0385501 0.3440095 0.0876256 0.0151148 -0.0613749 0.017817 0.0555636 0.0716442 -0.0237008 0.0116876 -0.1110048 -0.1300461 0.0743518 -0.0033609 0.0164232 0.0874328 -0.0134078 -0.0122208 -0.0162833 0.0886473 0.0693407 -0.1068072 0.0296125 -0.0532739 -0.1213528 0.010764 0.0332603 0.0283438 0.0642983 0.092226 0.0417151 -0.0127227 0.0100131 -0.0929215 0.0390346 -0.0095404 0.0365626 0.1412882 0.0821146 -0.0062571 -0.0027798 0.0148052 -0.0994536 0.0435326 -0.0079852 0.0440984 0.1701845 -0.0692557 -0.0928703 0.0045995 -0.102574 0.0199827 0.0186209 0.0043867 0.0185728 0.1652706 -0.1008411 0.0758935 -0.0254773 0.0807074 0.0574093 0.0202805 -0.027616 0.0205785 0.1547829 unknown
polarizability: 145.425433|-0.2159818|106.2428894|2.3014905|-5.7679095|52.9741736 unknown
InChI: InChI=1S/C9H9NO/c1-6-7-4-2-3-5-8(7)10-9(6)11/h2-6,10H,1H3
charge 0 multiplicity 1
20 atoms
O  3.154989 0.772385 0.123901
N  0.891993 1.444178 -0.074836
C  1.246858 -0.871266 0.325016
C  -0.235125 -0.55502 0.188738
C  -0.390707 0.840735 -0.045482
C  1.924325 0.510954 0.123105
C  1.805525 -1.92223 -0.667075
C  -1.369451 -1.377563 0.256273
C  -1.654133 1.436042 -0.212359
C  -2.655923 -0.798021 0.090062
C  -2.790743 0.59106 -0.140361
H  1.488419 -1.202948 1.355198
H  1.075535 2.434687 -0.23629
H  1.56857 -1.644758 -1.708936
H  2.90222 -1.986552 -0.562047
H  1.369064 -2.916425 -0.465773
H  -1.268704 -2.454271 0.435013
H  -1.76556 2.510762 -0.392056
H  -3.549241 -1.429355 0.141269
H  -3.788911 1.025304 -0.266558
