program: Gaussian 09
title: 000150891
version: EM64L-G09RevD.01
frameworkgroup: C1[X(C21H32O3)]
method: RPBEPBE
basis: SDD
operation: Freq
keyword: #pfreq=noraman
keyword: PBEPBE/SDD
title: #p freq=noraman PBEPBE/SDD
converged: YES YES NO NO
title: Mulliken charges:
elementType: O O O C C C C C C C C C C C C C C C C C C C C C H H H H H H H H H H H H H H H H H H H H H H H H H H H H H H H H
charge: -0.449029 -0.243038 -0.446249 0.378774 -0.106927 -0.194790 -0.084637 0.261583 -0.234104 -0.530732 -0.545057 -0.550072 -0.475097 -0.495753 0.525981 -0.826990 -0.497467 -0.487914 -0.832643 -0.709010 0.087125 -0.448516 -0.060868 -0.383932 0.204295 0.245305 0.198891 0.238771 0.199580 0.206982 0.230232 0.218403 0.212246 0.237022 0.260391 0.213146 0.219716 0.212683 0.226169 0.230788 0.247305 0.236254 0.205683 0.203996 0.218129 0.225686 0.225742 0.225242 0.215740 0.199192 0.228248 0.200706 0.239520 0.223916 0.334441 0.364939
chargesum: 0.00000
title: Mulliken charges with hydrogens summed into heavy atoms:
elementType: O O O C C C C C C C C C C C C C C C C C C C C C
charge: -0.114588 -0.243038 -0.081310 0.378774 0.097368 0.050516 0.114254 0.261583 0.004667 -0.124169 -0.096423 -0.100804 -0.001560 -0.063353 0.525981 -0.122728 -0.055529 -0.283918 -0.163086 -0.268027 0.087125 -0.021076 0.139838 0.079505
polarizability: 2.79881446e+02 -1.74120377e+00 2.17473046e+02 1.09431152e+00 -2.93321166e+00 1.78962694e+02
1716.lowfreq: -4.5003 -0.0001 0.0003 0.0006 8.9963 13.9069 34.5786 42.7544 51.3818
frequency: 34.4763 42.7156 51.3594 64.3938 79.1548 97.9604 122.0268 135.3015 172.4927 184.6016 188.3923 206.0197 215.8848 218.1377 227.7298 236.5167 248.2355 262.1154 270.2375 284.9756 300.0609 315.6204 329.8464 338.6823 362.5015 375.2576 398.8164 403.6373 413.0040 423.8020 440.2144 448.7679 469.4245 498.0822 510.6748 544.7295 560.3773 580.0356 605.7007 625.2332 674.0588 680.2102 697.8584 718.9815 737.5256 794.1545 813.4678 822.8552 825.4057 828.9251 838.8344 876.0463 889.9315 901.5092 902.6664 920.5488 936.0125 939.5984 943.8533 962.6775 976.0052 987.1758 996.0454 1002.0618 1004.3690 1016.4283 1022.4552 1033.6396 1041.9398 1059.0434 1067.1392 1080.5348 1091.3189 1095.3629 1117.8939 1119.7624 1126.3114 1132.3850 1138.6972 1141.4855 1150.7377 1170.0996 1178.6756 1181.3149 1190.9457 1196.0208 1212.3284 1216.2017 1225.4286 1227.9608 1239.8233 1248.4338 1252.6726 1261.8940 1270.9978 1278.6070 1292.9998 1294.0652 1299.7538 1306.5567 1322.3992 1327.8775 1332.3903 1335.4577 1343.7280 1345.2059 1347.4014 1352.8852 1357.5430 1363.0193 1372.8022 1383.0971 1387.9102 1392.8594 1403.1637 1445.7796 1451.2811 1454.5227 1456.9842 1459.3387 1464.0819 1468.6171 1471.4914 1476.3299 1480.3099 1490.7791 1491.8757 1496.8396 1602.7501 1685.5954 2906.9838 2926.3038 2927.7246 2938.5307 2941.9179 2953.0186 2958.2074 2968.8442 2974.3621 2982.2317 2986.1495 2992.2554 2993.5533 2994.0415 2995.9902 2997.6277 2999.3398 3005.9454 3014.8492 3016.5528 3044.6194 3051.9153 3052.9766 3056.4636 3073.6899 3075.9617 3076.9564 3078.3409 3081.2632 3098.3938 3404.7951 3563.6890
redmass: 4.8814 4.5757 5.5057 3.9172 4.4213 3.5642 2.7296 2.2199 2.5929 3.1400 1.9415 2.5232 2.3987 1.9855 1.7439 1.3543 2.3006 2.3416 2.1693 2.0272 2.5125 3.5797 2.8244 3.0795 2.9933 2.6252 2.1192 2.1327 1.9989 2.8900 2.7740 2.2717 3.2713 2.3272 2.6422 3.0114 3.3985 3.6770 3.3499 2.4359 3.8923 2.7024 2.9347 2.4690 3.2999 1.6836 2.6844 2.0809 1.8496 1.7974 2.1527 2.2396 2.2785 3.0050 1.9994 1.9806 2.1838 2.6269 1.8506 1.7525 2.2221 2.0278 2.3822 2.4789 2.9526 2.4112 1.9640 2.0900 2.4992 2.1865 2.0160 2.5587 2.0921 1.6268 2.0044 2.0114 1.8555 1.7723 2.0334 1.6662 1.4079 2.0273 1.8890 1.1377 1.5678 1.6896 1.3929 1.3544 1.5436 1.4630 1.3604 1.3631 1.3825 1.2739 1.4549 1.3799 1.3901 1.3324 1.5842 1.4823 1.4300 1.4351 1.3966 1.3732 1.5598 1.4231 1.4774 1.4354 1.5232 1.4592 1.4457 1.3272 1.4424 1.4874 1.1997 1.0767 1.0820 1.0770 1.0891 1.0764 1.0957 1.0843 1.0714 1.0758 1.0610 1.0778 1.0593 1.0598 6.9687 7.8764 1.0806 1.0792 1.0683 1.0759 1.0640 1.0605 1.0689 1.0824 1.0820 1.0368 1.0587 1.0565 1.0919 1.0574 1.0637 1.0649 1.0810 1.0986 1.0661 1.0902 1.0997 1.1007 1.1002 1.1023 1.0981 1.0913 1.0971 1.1004 1.1003 1.0985 1.0640 1.0660
irintensity: 0.5974 0.6264 0.7729 0.8273 2.2063 0.8661 5.6684 1.2740 1.5402 2.2672 6.1998 2.3800 4.8482 30.5951 3.1666 111.7347 0.7006 26.4126 14.3084 1.4754 1.2285 16.5985 1.2668 15.6258 7.2942 1.0892 17.4256 11.7673 28.5048 8.4992 12.0883 15.9422 14.9152 17.9658 0.5008 3.2655 1.4658 2.1174 1.4381 3.0346 3.0892 4.0021 3.9076 4.3232 1.2890 9.2505 1.9671 16.7116 1.4542 1.7204 6.9914 5.4364 28.6039 24.7183 2.7103 3.8354 7.2577 0.4328 1.5860 13.0771 6.6750 10.2826 23.6464 24.9516 32.3132 30.3077 12.3048 24.9350 42.2354 16.2441 14.8198 7.3996 11.5511 5.0073 13.8846 31.1124 6.8273 3.7042 1.0862 0.8402 6.1839 10.7483 6.8412 8.7231 0.3298 12.1801 7.3443 8.0297 9.6335 7.8593 11.0492 108.4486 7.1195 11.6417 7.6997 8.0170 7.7832 7.0028 11.9739 0.8242 0.7967 1.5227 12.8594 3.4878 33.8664 2.4417 14.5468 2.9643 4.7839 3.4422 26.9253 15.8669 39.8093 10.7193 29.5117 12.9596 17.4443 7.9654 8.4767 1.4364 4.7291 10.2971 3.8250 3.3950 23.6176 11.3479 2.1229 8.9154 80.8507 3.2661 11.9160 8.6736 41.4452 30.1515 32.9162 43.1538 93.4929 12.9296 34.0458 23.3765 39.3206 13.8553 19.5481 10.1499 12.9501 64.6747 57.8295 36.5933 49.5980 39.2479 22.2274 52.5938 24.2645 33.9953 30.3281 46.8847 56.5529 26.2382 32.5880 23.8760 27.4590 2.4166
temp: 298.150 k
press: 1.00000 atm
elementType: 8 8 8 6 6 6 6 6 6 6 6 6 6 6 6 6 6 6 6 6 6 6 6 6 1 1 1 1 1 1 1 1 1 1 1 1 1 1 1 1 1 1 1 1 1 1 1 1 1 1 1 1 1 1 1 1
symmnumber: 1
zpe: 1285002.8 jmol-1
zpe.correction: 0.489432 hartree
zpe.thermalcorrener: 0.512856 hartree
zpe.thermalcorrenthalpy: 0.513800 hartree
zpe.thermalcorrgfe: 0.438504 hartree
zpe.sumelectzpe: -1043.209743 hartree
zpe.sumelectthermal: -1043.186319 hartree
zpe.sumelectthermalent: -1043.185374 hartree
zpe.sumelectthermalfe: -1043.260671 hartree
dipole: 4.1143 2.3725 -0.1547
dipole: 4.7519
quadrupole: -172.5585 -148.2863 -147.3852
quadrupole: -4.2019 11.8003 -5.9636
quadrupole: -16.4819 7.7904 8.6915 -4.2019 11.8003 -5.9636
hfenergy: -1043.6991745 hartree
pointgroup: C01[X(C21H32O3)]
dipole: 1.6048283 -0.9574799 0.0536688 debye
polarizability: 279.8954251|0.7633225|217.3997455|-1.9427858|-3.1438097|179.022016 unknown
InChI: InChI=1S/C21H32O3/c1-20-9-7-14(23)11-13(20)3-4-15-16-5-6-18(19(24)12-22)21(16,2)10-8-17(15)20/h3,14-18,22-23H,4-12H2,1-2H3
charge 0 multiplicity 1
56 atoms
O  5.370339 0.288937 1.694327
O  -5.303382 -0.049135 -0.763306
O  -6.148227 2.220604 0.372394
C  -2.012766 0.055385 -0.091513
C  -1.072859 -1.117984 0.334003
C  0.349122 -1.026856 -0.255132
C  0.995774 0.339973 0.138993
C  2.434003 0.526332 -0.478312
C  -3.334963 -0.406612 0.660459
C  -1.379869 1.371518 0.419226
C  0.054285 1.545258 -0.148549
C  -1.915311 -2.390505 0.08067
C  -3.378615 -1.955981 0.432568
C  1.225635 -2.192326 0.262501
C  3.258237 -0.76535 -0.303269
C  -2.259662 0.112742 -1.621987
C  3.161198 1.680072 0.299279
C  2.703242 -1.958592 0.04089
C  2.366896 0.875609 -1.998386
C  4.758317 -0.657095 -0.544759
C  -4.586941 0.31717 0.215418
C  4.664131 1.821411 -0.023907
C  5.417117 0.507114 0.232911
C  -5.009232 1.573659 0.98316
H  -0.953272 -1.021781 1.439508
H  0.295929 -1.102662 -1.36101
H  1.141216 0.295872 1.24328
H  -3.172543 -0.18318 1.735642
H  -1.338167 1.349545 1.529063
H  -1.988786 2.252262 0.131727
H  -0.01864 1.714705 -1.23859
H  0.491927 2.466251 0.280073
H  -1.579077 -3.244241 0.694927
H  -1.839919 -2.702305 -0.978315
H  -4.081495 -2.189026 -0.385684
H  -3.750111 -2.465818 1.339189
H  0.920433 -3.140401 -0.224592
H  1.034168 -2.341144 1.349358
H  -2.859977 1.001957 -1.887913
H  -1.312264 0.172992 -2.183043
H  -2.812893 -0.769659 -1.98505
H  3.066326 1.483248 1.384123
H  2.655005 2.641482 0.088518
H  3.363051 -2.830649 0.169038
H  3.36656 0.842481 -2.466366
H  1.728093 0.15841 -2.544589
H  1.965832 1.892469 -2.160928
H  5.250833 -1.616636 -0.287191
H  4.966074 -0.484985 -1.622042
H  4.819586 2.117591 -1.079565
H  5.108729 2.614745 0.605115
H  6.477928 0.605126 -0.086451
H  -4.155451 2.280332 1.032778
H  -5.248147 1.2719 2.027144
H  5.625396 -0.648202 1.888159
H  -6.441213 1.623474 -0.37559
