program: Gaussian 09
title: 000013533
version: EM64L-G09RevD.01
frameworkgroup: C1[X(C9H20)]
method: RPBEPBE
basis: SDD
operation: Freq
keyword: #p
keyword: freq=noraman
keyword: PBEPBE/SDD
title: #p freq=noraman PBEPBE/SDD
converged: NO YES NO NO
title: Mulliken charges:
elementType: C C C C C C C C C H H H H H H H H H H H H H H H H H H H H
charge: 0.000518 -0.021477 -0.040215 -0.396050 -0.797030 -0.762609 -0.740385 -0.739769 -0.713481 0.193337 0.203381 0.198624 0.192745 0.195067 0.213707 0.224319 0.222599 0.208498 0.218261 0.221479 0.204322 0.223760 0.209041 0.223386 0.208047 0.207199 0.220436 0.212768 0.209519
chargesum: 0.00000
title: Mulliken charges with hydrogens summed into heavy atoms:
elementType: C C C C C C C C C
charge: 0.193855 0.181904 0.158409 -0.008238 -0.136404 -0.114370 -0.103262 -0.101136 -0.070758
polarizability: 1.07497258e+02 -5.49900051e-01 9.40137881e+01 -4.73709536e-01 -3.17173001e-01 9.10576982e+01
1716.lowfreq: -27.5764 -5.9305 -0.0005 0.0007 0.0007 4.0223 52.4387 64.3442 99.7622
frequency: 52.3371 64.1810 99.7126 163.8226 172.9262 184.3745 211.7357 222.3705 235.3277 253.4581 282.9674 348.2682 368.3478 381.7022 415.4363 441.2268 460.6745 559.4342 722.0527 794.9553 797.0543 865.2168 910.3084 915.2124 954.5016 957.0118 965.6746 992.1318 1002.3924 1024.8265 1064.2949 1087.9866 1130.0606 1161.2788 1168.1098 1173.3643 1190.4862 1253.3474 1271.7624 1287.3959 1306.2284 1317.9992 1321.7700 1344.9867 1349.4864 1372.8295 1380.8128 1386.5878 1387.3978 1392.8005 1461.3043 1466.9161 1469.5387 1476.0392 1477.8084 1479.3282 1481.2343 1484.2424 1488.6876 1491.7837 1502.7790 2939.7364 2959.9823 2964.9032 2966.7726 2969.2188 2971.8433 2973.1773 2975.1705 2982.1973 3014.0291 3055.5195 3062.1501 3063.0357 3065.8316 3070.0308 3070.2832 3071.9648 3072.8498 3076.4666 3084.8229
redmass: 2.5085 2.5180 1.9807 1.2574 1.5441 1.3166 1.2365 1.2872 1.2975 1.4123 2.0750 2.1230 2.3479 2.1303 2.7776 2.4350 2.4856 2.1518 1.8955 2.0156 1.3665 1.9234 1.2413 1.7238 1.2918 1.3840 1.2507 1.7730 1.6461 1.5878 2.3212 2.3713 2.0297 2.1454 2.1963 1.8730 2.2285 1.2089 1.3301 1.3289 1.2982 1.3089 1.4464 1.4289 1.4557 1.2178 1.2196 1.2150 1.2062 1.1989 1.0556 1.0557 1.0506 1.0492 1.0438 1.0553 1.0507 1.0496 1.0557 1.0515 1.0525 1.0797 1.0833 1.0610 1.0421 1.0563 1.0454 1.0461 1.0372 1.0377 1.0998 1.0988 1.0991 1.0982 1.0991 1.0983 1.0993 1.0985 1.0986 1.0986 1.0969
irintensity: 0.0012 0.0018 0.0078 0.0208 0.0647 0.0683 0.0241 0.0112 0.0333 0.0326 0.1106 0.2851 0.3024 0.3746 0.0838 0.5302 0.2931 3.2886 2.0798 1.0251 4.2938 2.4969 3.2847 0.6190 7.9201 9.0894 2.7480 21.9999 0.4918 2.3982 2.0958 6.7559 10.9184 0.9657 0.7380 2.6174 0.5061 0.5850 0.3969 0.6753 0.8736 4.4361 1.3904 0.5541 0.8438 7.4435 26.7370 45.7392 6.7446 5.3522 4.9619 8.5002 2.4837 11.2761 8.3809 10.5964 7.4440 3.7344 5.4787 31.5594 5.3862 4.1272 15.5538 13.1637 31.8750 14.4574 31.2995 102.4957 28.5147 27.0251 30.6408 1.2447 19.2464 80.5725 43.2668 114.9409 18.8710 45.6495 45.9697 89.3485 25.0073
temp: 298.150 k
press: 1.00000 atm
elementType: 6 6 6 6 6 6 6 6 6 1 1 1 1 1 1 1 1 1 1 1 1 1 1 1 1 1 1 1 1
symmnumber: 1
zpe: 704949.0 jmol-1
zpe.correction: 0.268501 hartree
zpe.thermalcorrener: 0.281054 hartree
zpe.thermalcorrenthalpy: 0.281998 hartree
zpe.thermalcorrgfe: 0.230840 hartree
zpe.sumelectzpe: -354.173901 hartree
zpe.sumelectthermal: -354.161348 hartree
zpe.sumelectthermalent: -354.160404 hartree
zpe.sumelectthermalfe: -354.211562 hartree
dipole: -0.0480 0.0660 -0.0685
dipole: 0.1065
quadrupole: -60.9089 -61.2198 -61.2390
quadrupole: 0.0451 0.2414 -0.0782
quadrupole: 0.2137 -0.0972 -0.1165 0.0451 0.2414 -0.0782
hfenergy: -354.4424021 hartree
pointgroup: C01 [X(C9H20)]
dipole: 0.0194057 0.0271325 0.0253564 debye
polarizability: 107.5104787|0.279604|94.026315|-0.5209867|0.151369|91.0319506 unknown
InChI: InChI=1S/C9H20/c1-6-8(4)9(5)7(2)3/h7-9H,6H2,1-5H3
charge 0 multiplicity 1
29 atoms
C  -0.244857 -0.436797 -0.065707
C  0.906096 0.628731 -0.044094
C  -1.676006 0.202082 -0.006573
C  2.327698 0.004823 0.067658
C  -0.112517 -1.411017 -1.265344
C  0.856985 1.597297 -1.252216
C  -2.776576 -0.881378 0.134295
C  -1.825273 1.228839 1.144888
C  2.539225 -0.926602 1.281783
H  -0.140803 -1.034779 0.866704
H  0.76679 1.231494 0.877752
H  -1.852312 0.734411 -0.965852
H  3.05437 0.841119 0.129081
H  2.575555 -0.539322 -0.865992
H  -0.346181 -0.906051 -2.221823
H  0.909536 -1.822629 -1.343145
H  -0.79986 -2.268677 -1.165181
H  1.657388 2.356977 -1.172194
H  1.008128 1.057797 -2.205919
H  -0.106795 2.133798 -1.317176
H  -2.612614 -1.487878 1.046814
H  -2.803233 -1.566786 -0.730406
H  -3.775106 -0.412742 0.217751
H  -1.179015 2.113465 1.006909
H  -2.869779 1.58701 1.209064
H  -1.568219 0.767794 2.118911
H  1.942129 -1.853142 1.200784
H  3.600608 -1.223915 1.37059
H  2.250538 -0.422624 2.224137
