program: Gaussian 09
title: 000150851
version: EM64L-G09RevD.01
frameworkgroup: C1[X(C9H11FN2O5)]
method: RPBEPBE
basis: SDD
operation: Freq
keyword: #p
keyword: freq=noraman
keyword: PBEPBE/SDD
title: #p freq=noraman PBEPBE/SDD
converged: YES YES NO NO
title: Mulliken charges:
elementType: F O O O O O N N C C C C C C C C C H H H H H H H H H H H
charge: -0.198538 -0.276798 -0.399343 -0.429052 -0.253603 -0.239302 -0.202728 -0.396585 -0.180767 -0.043373 -0.067936 -0.034895 -0.333038 0.211668 -0.085980 -0.298139 0.148498 0.214360 0.318905 0.279652 0.287210 0.196557 0.176167 0.345184 0.288100 0.363506 0.256531 0.353737
chargesum: 0.00000
title: Mulliken charges with hydrogens summed into heavy atoms:
elementType: F O O O O O N N C C C C C C C C C
charge: -0.198538 -0.276798 -0.054159 -0.075315 -0.253603 -0.239302 -0.202728 -0.033078 0.033593 0.236279 0.250969 0.252315 0.039687 0.211668 0.202120 -0.041608 0.148498
polarizability: 1.63496076e+02 7.37374017e+00 1.31861340e+02 9.62085649e+00 8.27514492e+00 8.25705813e+01
1716.lowfreq: -5.5986 -0.0004 0.0010 0.0012 7.6535 15.4343 26.3520 41.9608 54.3191
frequency: 26.3208 41.9516 54.2781 84.1555 96.3916 141.9765 169.7035 174.2396 204.7213 214.1348 234.3009 241.3556 260.6740 281.6039 295.3961 336.2745 377.6846 400.3171 416.0710 478.9683 517.9131 531.0350 550.2720 593.2446 657.1810 684.5080 700.2717 727.8399 747.7443 770.2770 799.4541 810.1006 824.4948 869.0853 934.8454 940.0454 968.6155 981.3264 1006.0983 1018.9040 1027.9694 1048.1801 1054.4986 1072.5160 1118.8918 1147.0621 1191.2230 1197.6039 1204.3188 1219.2347 1227.5157 1248.3932 1256.0888 1278.2392 1306.8751 1323.0336 1327.6856 1340.8344 1350.0825 1364.9517 1388.7825 1410.5749 1428.6903 1454.1450 1596.4286 1639.5661 1666.4522 2904.7646 2940.5902 2976.1036 3053.9254 3067.7517 3124.6874 3189.2201 3216.1469 3520.6240 3569.5778 3575.5560
redmass: 6.1500 7.7188 6.5091 6.6334 4.7031 8.2874 7.1588 2.9591 1.9627 2.2250 2.8517 1.8373 3.5944 6.0601 7.2933 5.9871 9.5626 4.0636 3.4811 3.3570 6.7818 7.4136 6.5245 6.0880 4.6453 3.0323 2.4177 4.7886 7.6506 1.8302 3.4160 1.9042 4.9926 3.2887 3.0782 3.1635 1.3753 4.5271 3.0048 2.6371 3.5237 2.8816 2.4356 3.8782 2.4198 3.3669 1.1898 1.2933 2.5106 1.1126 1.3612 1.3649 1.7072 1.2834 1.5176 1.2392 2.0168 1.4473 1.4148 1.7642 1.5718 3.1373 1.5801 1.0838 5.9271 10.6719 6.1177 1.0618 1.0826 1.0969 1.0861 1.0877 1.0899 1.0892 1.0983 1.0770 1.0667 1.0668
irintensity: 1.0527 1.3346 6.2142 2.3347 5.1048 0.6661 1.6029 24.5348 67.9041 71.3319 50.2915 65.4364 39.3482 26.7094 24.8616 5.5950 9.4453 4.9162 13.1420 28.0051 5.7842 26.9420 6.8122 6.7006 29.4613 22.9544 9.1075 16.3991 5.6709 58.2471 8.2635 109.4307 15.0681 13.5240 70.8240 1.4050 5.5301 84.5528 81.4339 21.7556 193.5792 50.8552 20.9221 27.8281 8.5440 16.7727 18.1472 11.1395 39.4902 15.0284 46.4595 13.7377 116.5483 4.0738 32.0237 15.3670 84.3385 10.7683 1.9582 17.2651 3.7075 95.9020 3.8280 9.1900 23.8578 267.4857 756.4461 76.7199 40.2672 59.6134 22.8060 3.5863 7.5925 7.3288 0.2938 61.1365 11.1533 8.2789
temp: 298.150 k
press: 1.00000 atm
elementType: 9 8 8 8 8 8 7 7 6 6 6 6 6 6 6 6 6 1 1 1 1 1 1 1 1 1 1 1
symmnumber: 1
zpe: 539471.3 jmol-1
zpe.correction: 0.205474 hartree
zpe.thermalcorrener: 0.221564 hartree
zpe.thermalcorrenthalpy: 0.222508 hartree
zpe.thermalcorrgfe: 0.160819 hartree
zpe.sumelectzpe: -933.720219 hartree
zpe.sumelectthermal: -933.704129 hartree
zpe.sumelectthermalent: -933.703184 hartree
zpe.sumelectthermalfe: -933.764874 hartree
dipole: -3.9177 4.7158 3.2058
dipole: 6.9184
quadrupole: -115.6408 -101.2782 -98.2593
quadrupole: -18.9007 -14.3087 2.1728
quadrupole: -10.5813 3.7812 6.8001 -18.9007 -14.3087 2.1728
hfenergy: -933.9256923 hartree
pointgroup: C01 [X(C9H11F1N2O5)]
dipole: -1.5243783 -1.9799916 -1.0792271 debye
polarizability: 163.1194327|-6.8495347|132.2731464|-12.4015495|4.9721027|82.5354175 unknown
InChI: InChI=1S/C9H11FN2O5/c10-6-7(15)4(3-13)17-8(6)12-2-1-5(14)11-9(12)16/h1-2,4,6-8,11,13,15H,3H2
charge 0 multiplicity 1
28 atoms
F  -2.057466 2.397786 0.401624
O  -1.315527 -0.495548 1.112815
O  -3.144511 1.036285 -1.722527
O  -3.59436 -2.479077 1.010318
O  1.672752 2.337071 0.329791
O  4.638155 -1.092977 -0.85693
N  0.874544 0.1277 0.315674
N  3.12228 0.586253 -0.261668
C  -2.073133 0.396718 -0.985024
C  -1.19633 1.455842 -0.296755
C  -0.459361 0.64105 0.794174
C  -2.520578 -0.478132 0.216426
C  -2.911666 -1.902752 -0.146153
C  1.888501 1.107568 0.141951
C  1.134704 -1.23273 0.162796
C  2.362713 -1.706696 -0.228839
C  3.470718 -0.788094 -0.485812
H  -1.415264 -0.203812 -1.654668
H  -0.29096 1.266075 1.686989
H  -0.540742 2.041547 -0.955694
H  -3.350915 0.016536 0.752884
H  -2.005029 -2.480893 -0.427588
H  -3.593757 -1.865544 -1.028852
H  -3.6548 0.355019 -2.228477
H  0.293237 -1.883281 0.408216
H  3.868751 1.275041 -0.403844
H  2.547749 -2.775511 -0.338038
H  -3.780305 -3.438444 0.852512
