program: Gaussian 09
title: 000150786
version: EM64L-G09RevD.01
frameworkgroup: C1[X(C21H34O4)]
method: RPBEPBE
basis: SDD
operation: Freq
keyword: #pfreq=noraman
keyword: PBEPBE/SDD
title: #p freq=noraman PBEPBE/SDD
converged: NO YES NO NO
title: Mulliken charges:
elementType: O O O O C C C C C C C C C C C C C C C C C C C C C H H H H H H H H H H H H H H H H H H H H H H H H H H H H H H H H H H
charge: -0.220862 -0.433221 -0.425051 -0.465619 -0.148562 0.412847 -0.120093 -0.140945 0.237794 -0.043793 -0.548049 -0.510197 -0.087361 -0.548408 -0.522803 -0.499784 -0.472267 -0.852751 -0.530398 0.047735 -0.805414 -0.470123 0.124344 -0.227818 -0.715431 0.212406 0.233463 0.215226 0.204723 0.201237 0.211443 0.227603 0.211119 0.247872 0.208745 0.228644 0.221192 0.214317 0.213098 0.213603 0.202449 0.220145 0.226957 0.223359 0.231502 0.247450 0.227070 0.245225 0.230358 0.217194 0.211471 0.205549 0.267894 0.226508 0.209722 0.215840 0.371038 0.349454 0.372353
chargesum: 0.00000
title: Mulliken charges with hydrogens summed into heavy atoms:
elementType: O O O O C C C C C C C C C C C C C C C C C C C C C
charge: -0.220862 -0.062183 -0.075597 -0.093266 0.063844 0.412847 0.113370 0.074281 0.237794 0.160931 -0.135369 -0.071475 0.160510 -0.111019 -0.087295 -0.073083 -0.049673 -0.170933 -0.055879 0.047735 -0.112637 -0.053103 0.124344 0.040076 -0.063360
polarizability: 2.66770135e+02 -1.34775936e+00 2.14329232e+02 3.56702531e+00 -6.38116048e+00 2.00492026e+02
1716.lowfreq: -12.8563 -6.0376 -0.0010 -0.0008 -0.0005 11.5684 32.5689 50.8379 62.2909
frequency: 32.2657 50.6808 62.2431 73.1243 87.5720 102.5009 113.9216 131.5888 143.7899 176.0529 184.1500 195.3820 220.4848 232.5986 235.1420 238.8661 251.4638 264.5836 269.3382 277.5856 283.0064 295.5199 304.2950 312.6315 330.3877 351.7073 357.9032 374.9981 383.2122 394.4910 402.7687 426.7944 444.9834 446.0857 478.5111 481.4512 520.8494 528.7713 561.6044 568.9639 581.8175 593.5590 605.8627 624.7089 630.3533 692.6488 698.5289 718.7513 771.2888 776.2284 803.2058 819.1467 828.1009 836.2763 843.9516 845.1389 880.7145 891.5952 896.2257 914.4448 928.0959 937.7336 944.4801 963.9106 974.8628 982.5122 991.2948 993.4050 1002.6590 1009.7453 1022.7020 1032.2287 1042.4652 1054.6158 1066.2530 1072.4635 1083.4536 1089.1670 1094.0823 1104.1974 1108.9566 1120.1698 1129.0015 1132.2810 1150.5044 1154.7650 1158.9056 1175.1471 1179.4524 1195.7738 1207.4015 1213.0825 1220.3691 1225.6136 1239.3235 1248.1773 1257.6085 1262.9735 1264.3860 1270.0370 1280.3712 1287.9687 1291.5265 1297.9050 1307.3411 1316.2555 1318.9792 1323.8701 1330.0697 1333.9018 1335.3677 1340.0793 1348.0511 1349.6747 1352.3883 1355.4284 1367.8035 1373.0820 1381.7848 1386.3859 1395.4919 1399.8075 1452.3904 1458.6803 1464.2589 1465.4507 1466.2576 1472.7710 1475.8171 1476.8076 1480.8970 1482.5555 1483.5661 1485.6369 1492.2655 1497.4465 1587.5910 2906.4384 2931.9845 2936.5778 2954.1173 2961.9624 2963.2483 2972.6788 2976.7077 2978.6161 2980.1018 2981.3362 2984.8273 2995.4747 2997.2946 3002.0105 3003.9493 3004.7845 3015.5553 3017.0939 3025.6357 3038.5679 3039.2291 3041.0072 3062.9435 3067.4735 3069.8986 3070.9704 3072.0831 3077.7040 3091.8733 3111.9929 3342.0568 3408.9282 3554.3075
redmass: 5.0550 3.3185 4.4813 4.1256 3.2557 6.6126 2.1026 3.1775 2.4365 1.1825 2.3117 2.1187 1.5351 2.3429 2.2943 1.3409 2.4979 2.2783 1.9556 3.0584 3.0842 3.1796 2.9729 2.7226 2.7483 2.4949 2.1836 2.6111 5.1223 3.4816 3.4185 3.5577 3.5123 3.2736 2.6770 3.3143 3.0676 2.6224 1.5849 2.4071 2.7103 3.2784 3.5984 2.7689 3.2074 1.2924 2.2623 2.1679 1.2683 2.8987 3.5932 2.0708 1.8606 2.2387 2.4092 2.3843 1.9796 2.3674 2.8445 1.7956 1.7333 1.9280 1.9784 1.9693 3.0379 3.0518 2.6162 2.0037 2.3518 1.8931 2.0250 1.7663 2.1893 2.1809 1.9154 2.3343 2.2002 2.3616 2.1042 1.9813 2.0135 1.7414 1.9108 2.2815 2.3120 1.8653 1.9118 1.7642 1.5937 1.7477 1.6433 1.2845 1.6601 1.9107 1.5605 1.3969 1.4149 1.3416 1.4983 1.3805 1.3145 1.3355 1.3963 1.3060 1.3492 1.4791 1.3816 1.3917 1.3421 1.4430 1.4565 1.4081 1.4295 1.4145 1.5041 1.4421 1.4850 1.5771 1.8201 1.2122 1.2081 1.1976 1.0837 1.0782 1.0687 1.0691 1.0774 1.0771 1.0753 1.0580 1.0655 1.0675 1.0752 1.0617 1.0685 1.0591 9.2154 1.0811 1.0825 1.0803 1.0615 1.0664 1.0594 1.0363 1.0763 1.0610 1.0673 1.0619 1.0412 1.0788 1.0636 1.0714 1.0515 1.0606 1.0986 1.0996 1.0971 1.1004 1.1002 1.0992 1.1019 1.0998 1.0974 1.0982 1.0998 1.0980 1.0971 1.0994 1.0634 1.0631 1.0651
irintensity: 0.0420 0.1888 0.4835 0.1992 0.2719 0.3479 0.1542 0.2770 0.2800 0.0303 0.2522 0.0729 0.5388 17.5632 13.5890 0.9584 20.4875 16.0621 12.5885 8.9770 5.7282 3.1133 7.9111 1.0638 9.0591 24.2954 0.1470 11.1293 31.5930 1.6454 2.4417 5.1164 4.0482 0.0879 0.8535 11.3728 2.4966 0.0368 73.8223 37.8948 9.1360 0.3266 6.2342 1.2730 41.2873 119.4139 7.3870 6.7546 4.4905 5.5281 10.8974 0.7515 0.6367 10.5584 10.2972 0.2778 1.8109 10.7795 31.3695 7.3287 1.6401 9.3994 11.5991 13.5482 75.3419 113.4258 9.4364 2.2306 54.2447 6.2002 54.9733 51.6965 54.1533 5.8229 12.0127 3.1617 5.4609 2.7504 13.9086 17.4637 31.9678 2.9371 10.6679 17.5422 5.3222 9.9745 3.1362 13.9442 41.7406 11.1654 2.3514 1.2788 15.0347 13.6643 4.3690 1.3982 1.6104 33.8388 12.6899 1.3617 2.2928 1.2810 4.7525 7.0844 7.2440 16.8513 0.2640 1.8193 0.6578 20.2153 17.4337 16.1095 14.3988 5.9716 9.8351 5.3131 6.0622 50.7599 68.3033 11.4371 16.7764 37.8336 6.4128 1.0836 18.6988 10.5712 4.5069 11.8904 7.0968 8.2351 1.2321 12.1965 2.8681 9.0776 5.3976 4.4337 104.2251 7.2229 18.1930 16.0208 37.5458 14.3728 27.7069 37.5574 25.0380 33.1929 29.4093 31.3942 31.2204 25.6099 48.4800 26.9143 28.2192 16.4549 23.6971 27.1864 34.6630 8.0398 1.4797 112.6355 57.6276 71.9784 18.9336 34.5130 51.8705 45.0010 28.9907 17.2073 56.6237 38.8546 11.2667
temp: 298.150 k
press: 1.00000 atm
elementType: 8 8 8 8 6 6 6 6 6 6 6 6 6 6 6 6 6 6 6 6 6 6 6 6 6 1 1 1 1 1 1 1 1 1 1 1 1 1 1 1 1 1 1 1 1 1 1 1 1 1 1 1 1 1 1 1 1 1 1
symmnumber: 1
zpe: 1354797.4 jmol-1
zpe.correction: 0.516015 hartree
zpe.thermalcorrener: 0.540744 hartree
zpe.thermalcorrenthalpy: 0.541688 hartree
zpe.thermalcorrgfe: 0.464536 hartree
zpe.sumelectzpe: -1119.558506 hartree
zpe.sumelectthermal: -1119.533777 hartree
zpe.sumelectthermalent: -1119.532833 hartree
zpe.sumelectthermalfe: -1119.609986 hartree
dipole: -3.1449 2.7132 0.2606
dipole: 4.1617
quadrupole: -163.6237 -155.0797 -157.2606
quadrupole: 8.7618 -0.4795 -2.9824
quadrupole: -4.9690 3.5750 1.3941 8.7618 -0.4795 -2.9824
hfenergy: -1120.0745213 hartree
pointgroup: C01 [X(C21H34O4)]
dipole: 1.2487831 -1.0309325 0.2420788 debye
polarizability: 266.8286685|-1.2003583|215.6820344|-3.18028|4.3809953|199.0806907 unknown
InChI: InChI=1S/C21H34O4/c1-4-12-6-8-15-14-7-5-13-11-21(24,25)18(23)17(22)20(13,3)16(14)9-10-19(12,15)2/h12-16,18,23-25H,4-11H2,1-3H3
charge 0 multiplicity 1
59 atoms
O  -2.924659 1.925861 1.45118
O  -4.888175 -0.410798 -0.677903
O  -3.696598 -0.126356 -2.736254
O  -4.057246 2.132435 -0.887183
C  2.078514 -0.902648 -0.202117
C  2.813653 0.422097 0.184664
C  0.768155 -1.137644 0.578626
C  -0.177556 0.078867 0.30985
C  -1.565822 -0.091916 1.056122
C  4.070652 0.312016 -0.743476
C  1.863133 1.605382 -0.122823
C  0.505798 1.441956 0.613106
C  -2.24881 -1.445722 0.592582
C  3.197282 -1.973802 -0.157561
C  0.084217 -2.471641 0.186937
C  4.478397 -1.201394 -0.633994
C  -1.300044 -2.645479 0.854241
C  3.248259 0.454623 1.675855
C  -2.700082 -1.423985 -0.888346
C  -2.498113 1.046134 0.64686
C  -1.413913 -0.067214 2.597559
C  5.22087 1.304129 -0.471272
C  -3.581103 -0.230161 -1.275928
C  -2.999911 1.133445 -0.811021
C  6.334443 1.243226 -1.541383
H  1.789447 -0.785161 -1.273317
H  1.005328 -1.180926 1.661627
H  -0.383717 0.063775 -0.783521
H  3.713318 0.49737 -1.781601
H  1.682559 1.648276 -1.218024
H  2.32183 2.571997 0.165765
H  0.662045 1.551611 1.702419
H  -0.168253 2.271188 0.317908
H  -3.160389 -1.571899 1.210727
H  2.972835 -2.843435 -0.800467
H  3.32741 -2.358336 0.872597
H  0.737789 -3.318298 0.471394
H  -0.014937 -2.51617 -0.917565
H  5.306501 -1.3232 0.090912
H  4.846011 -1.587013 -1.601658
H  -1.783122 -3.571359 0.483661
H  -1.16712 -2.779417 1.944698
H  3.725778 1.422502 1.915115
H  2.394756 0.334873 2.365104
H  3.976197 -0.342606 1.909654
H  -1.835767 -1.425688 -1.574353
H  -3.278974 -2.344673 -1.09672
H  -1.119157 0.93276 2.954064
H  -2.379413 -0.305391 3.078315
H  -0.668427 -0.799932 2.944944
H  5.664242 1.100208 0.523743
H  4.815154 2.336152 -0.43098
H  -2.163698 1.406802 -1.483652
H  6.795952 0.239362 -1.581856
H  5.930139 1.467693 -2.546881
H  7.136679 1.97382 -1.329171
H  -5.318513 0.492804 -0.713435
H  -4.311665 -0.847019 -3.03117
H  -4.026859 2.619619 -0.009199
