program: Gaussian 09
title: 000150784
version: EM64L-G09RevD.01
frameworkgroup: C1[X(C3H5IO2)]
method: RPBEPBE
basis: SDD
operation: Freq
keyword: #pfreq=noraman
keyword: PBEPBE/SDD
title: #p freq=noraman PBEPBE/SDD
converged: NO YES NO NO
title: Mulliken charges:
elementType: I O O C C C H H H H H
charge: 0.084175 -0.400618 -0.212554 -0.580185 -0.618759 0.272964 0.327100 0.232933 0.243264 0.266187 0.385494
chargesum: 0.00000
title: Mulliken charges with hydrogens summed into heavy atoms:
elementType: I O O C C C
charge: 0.084175 -0.015124 -0.212554 -0.253085 0.123625 0.272964
polarizability: 8.16554181e+01 -7.96838007e+00 5.33747031e+01 3.28173331e+00 -4.15879040e-01 4.23250052e+01
1716.lowfreq: -18.2080 -6.7419 -0.0009 -0.0008 -0.0008 14.4774 57.2126 132.2279 229.2987
frequency: 57.0165 132.2258 229.2854 239.1285 254.7476 391.3371 489.3084 580.6074 615.7879 712.7021 799.9318 977.6875 1031.9214 1066.9671 1094.6552 1171.2320 1249.7258 1349.8922 1397.9223 1459.3912 1464.1899 1654.2123 2989.3361 3087.8473 3105.5530 3131.0767 3516.2217
redmass: 8.6135 8.9166 1.4524 2.2321 2.5655 4.7038 3.4496 4.3195 1.2521 5.3019 3.2477 1.3907 2.9280 1.4759 2.0261 1.3537 1.4947 2.0167 1.2034 1.0430 1.0503 8.6149 1.0407 1.0926 1.0891 1.0999 1.0642
irintensity: 1.6701 0.4338 1.2208 1.0936 2.8789 9.8670 22.0774 12.7173 163.3910 19.7290 4.0405 22.6202 242.9744 27.3089 63.9056 25.4880 3.2110 52.1558 20.4129 14.0391 13.8110 232.6421 11.3030 8.7829 3.3531 8.4001 35.0776
temp: 298.150 k
press: 1.00000 atm
elementType: 53 8 8 6 6 6 1 1 1 1 1
symmnumber: 1
zpe: 204860.0 jmol-1
zpe.correction: 0.078027 hartree
zpe.thermalcorrener: 0.085101 hartree
zpe.thermalcorrenthalpy: 0.086045 hartree
zpe.thermalcorrgfe: 0.044649 hartree
zpe.sumelectzpe: -278.799333 hartree
zpe.sumelectthermal: -278.792260 hartree
zpe.sumelectthermalent: -278.791315 hartree
zpe.sumelectthermalfe: -278.832711 hartree
dipole: -0.8109 0.2878 -1.5672
dipole: 1.7879
quadrupole: -48.5113 -44.9913 -53.5934
quadrupole: 2.8979 4.7803 -2.8399
quadrupole: 0.5207 4.0407 -4.5614 2.8979 4.7803 -2.8399
hfenergy: -278.8773605 hartree
pointgroup: C01 [X(C3H5I1O2)]
dipole: 0.1631281 0.1832128 0.6592604 debye
dipolederiv: -0.2147397 -0.158593 -0.0307874 -0.1121527 -0.2917155 -0.0703995 -0.0386899 -0.1171811 -0.0918783 -0.7509363 0.3092648 -0.3930329 0.3875767 -0.6942546 0.2894514 -0.318988 0.2081217 -0.5194385 -0.6802516 -0.1642383 0.1860622 0.0781232 -0.5772531 0.2340394 0.1310837 0.410228 -0.6208633 -0.1020708 0.164293 0.1198885 0.2042218 0.5653504 0.2568872 0.2196823 0.2984895 0.1599174 -0.0431689 -0.0977052 -0.0437014 -0.0012228 -0.2083853 -0.0230945 -0.0138997 -0.1016349 -0.0072306 1.4249068 -0.0414112 0.0719041 -0.4314248 0.7378549 -0.6500099 -0.1146607 -0.7782039 0.7426941 0.0362076 -0.0275213 -0.0715133 -0.0209097 -0.0150652 -0.0266949 -0.0143696 0.0004803 -0.0357828 0.0579811 -0.0397825 -0.0682688 -0.0744455 -0.0706596 -0.0874669 -0.0633286 -0.0472537 0.0673005 -0.0795408 0.0465676 0.0810013 -0.0027249 0.0997905 0.0103015 0.0774846 0.0083648 0.088206 0.1330271 0.0128109 0.0237158 0.0066025 0.1010292 0.0148028 -0.0163396 0.0653223 -0.0556815 0.2185855 -0.0036848 0.1247319 -0.0336437 0.3533082 0.0521834 0.1520254 0.053267 0.272757 unknown
polarizability: 65.9402859|15.3128942|67.3217685|6.3279013|6.4479831|44.093072 unknown
InChI: InChI=1S/C3H5IO2/c1-2(4)3(5)6/h2,5H,1H3
charge 0 multiplicity 1
11 atoms
I  -1.813586 -1.453546 -0.431672
O  1.572579 -0.907601 0.667533
O  1.280104 0.706961 -0.98412
C  -0.581646 0.151811 0.546874
C  -1.217098 1.522346 0.315773
C  0.818295 0.040075 -0.033274
H  -0.579354 -0.167595 1.599181
H  -0.625433 2.292081 0.848874
H  -2.249376 1.546245 0.699801
H  -1.22027 1.779464 -0.755063
H  2.474785 -0.987141 0.253493
