program: Gaussian 09
title: 000150776
version: EM64L-G09RevD.01
frameworkgroup: C1[X(C3H5N5O3)]
method: RPBEPBE
basis: SDD
operation: Freq
keyword: #pfreq=noraman
keyword: PBEPBE/SDD
title: #p freq=noraman PBEPBE/SDD
converged: NO YES NO NO
title: Mulliken charges:
elementType: O O O N N N N N C C C H H H H H
charge: -0.242794 -0.197900 -0.134639 -0.226774 -0.019747 -0.324586 0.036698 0.142061 -0.377079 -0.461647 0.360907 0.274747 0.275037 0.258499 0.258434 0.378781
chargesum: 0.00000
title: Mulliken charges with hydrogens summed into heavy atoms:
elementType: O O O N N N N N C C C
charge: -0.242794 -0.197900 -0.134639 -0.226774 -0.019747 0.054194 0.036698 0.142061 0.172705 0.055287 0.360907
polarizability: 1.14092111e+02 -5.54428902e-01 1.08922235e+02 -3.24464617e-03 1.45573669e-03 3.97767729e+01
1716.lowfreq: -6.4793 0.0011 0.0011 0.0014 6.4222 7.7908 50.3632 77.5036 105.1739
frequency: 50.3076 77.4829 105.1724 121.3518 153.5643 198.1328 262.5730 300.5966 368.9567 394.1941 513.5740 636.0122 664.6237 666.6269 674.1197 697.0632 782.3554 809.4943 823.0093 895.7230 949.2614 986.7193 1068.8756 1102.5668 1111.3015 1155.3552 1169.6552 1201.8630 1226.1083 1303.6005 1309.8099 1345.8476 1387.6019 1464.9884 1478.8599 1505.7900 1635.5678 3024.0898 3033.6048 3076.7085 3096.7665 3482.2978
redmass: 11.2981 6.9254 2.7390 11.5254 3.8831 7.8489 4.6293 8.2021 6.4755 11.0815 10.2744 6.7444 10.5461 7.9460 1.2024 8.0608 7.6540 1.1824 6.9891 8.7883 3.3461 5.8353 1.6921 3.7981 6.6016 12.9510 1.1381 1.0749 3.2251 1.3043 1.6315 12.6354 4.6106 1.0991 1.0821 2.5536 10.1817 1.0580 1.0608 1.1075 1.1063 1.0796
irintensity: 0.8053 0.0873 4.0232 8.2247 3.8047 3.7794 5.7684 4.1022 4.5450 0.1082 1.0820 1.1424 32.6729 37.8272 100.2573 7.4012 26.7239 1.3198 15.8513 62.7893 13.5118 63.0006 0.0271 17.9365 206.8458 447.4583 1.6317 0.0134 29.0881 32.7041 1.0883 204.5997 166.4012 8.8065 12.9784 175.5569 200.5010 5.5238 22.1921 0.0480 16.8759 103.1360
temp: 298.150 k
press: 1.00000 atm
elementType: 8 8 8 7 7 7 7 7 6 6 6 1 1 1 1 1
symmnumber: 1
zpe: 277008.3 jmol-1
zpe.correction: 0.105507 hartree
zpe.thermalcorrener: 0.115539 hartree
zpe.thermalcorrenthalpy: 0.116483 hartree
zpe.thermalcorrgfe: 0.068743 hartree
zpe.sumelectzpe: -615.722105 hartree
zpe.sumelectthermal: -615.712073 hartree
zpe.sumelectthermalent: -615.711129 hartree
zpe.sumelectthermalfe: -615.758869 hartree
dipole: -4.3948 1.9212 0.0039
dipole: 4.7963
quadrupole: -74.7290 -69.2625 -59.6394
quadrupole: -13.1191 -0.0091 -0.0147
quadrupole: -6.8520 -1.3855 8.2375 -13.1191 -0.0091 -0.0147
hfenergy: -615.8276123 hartree
pointgroup: C01 [X(C3H5N5O3)]
dipole: -1.6436603 -0.9269447 -0.0029334 debye
dipolederiv: -0.9162122 0.9026229 -0.0030812 0.0740207 -0.4715405 0.0005709 -0.0023295 0.0027801 -0.2018733 -0.7867078 -0.2385934 -0.0010033 -0.4437275 -0.7743211 0.0003775 0.0000036 0.0015438 -0.2132501 -0.6053278 0.092399 -0.0017209 0.3118976 -0.5687274 0.0025876 -0.0022613 0.0013856 -0.1539896 -0.6122795 0.2652548 -0.0020063 0.5084178 -0.8834479 0.002676 -0.0024748 0.0030471 -0.0766754 -0.4581228 0.1647847 -0.0013634 -0.1762462 -0.6539608 0.0013538 -0.0004371 -0.0005853 -0.3260013 -1.7937677 -0.4245076 -0.0025768 -0.1376655 -0.4990545 0.0008042 -0.0038114 0.0001141 -0.2942719 0.6186649 -0.9673338 0.0027451 -0.692105 0.9909331 -0.003285 0.0031826 -0.0038976 -0.0315121 2.5101135 0.3603638 0.006259 -0.105653 1.2418357 -0.00379 0.0078433 -0.002538 0.2251173 0.0674256 -0.0606406 -0.0001611 0.1415597 -0.0186034 0.0024232 0.001243 -0.0010211 0.2861379 0.2501772 0.0856582 -0.0002258 0.0193649 0.2532644 -0.0005538 0.0003956 0.0023474 0.2357912 1.3871366 0.0059729 0.0021005 0.5289117 0.9391631 -0.0016587 0.0002371 -0.00158 0.2569504 0.0243649 -0.0122347 -0.0586571 0.0308477 0.0630673 0.0268198 -0.0791051 -0.0016124 -0.0164257 0.0219767 -0.0116156 0.0594795 0.0327106 0.0635517 -0.027482 0.0785794 0.0010641 -0.0125283 0.0240924 -0.0756468 0.015891 0.0030666 0.0300655 0.0716806 0.0444298 0.1222144 -0.0165704 0.0256286 -0.0747916 -0.0152504 0.00224 0.0270835 -0.0724484 -0.0448643 -0.123157 -0.0128114 0.2428376 -0.0116922 -0.0004288 -0.0976401 0.2606913 -0.0000756 -0.0006308 -0.0001052 0.3519127 unknown
polarizability: 113.9270953|1.064037|109.0863052|0.1780171|-0.1870074|39.7777187 unknown
InChI: InChI=1S/C3H5N5O3/c9-6-7-2-1-4-3(7)5-8(10)11/h5H,1-2H2
charge 0 multiplicity 1
16 atoms
O  -2.822026 1.783961 -0.010691
O  3.079345 1.599095 0.00196
O  2.903104 -0.69608 0.008909
N  -1.301701 0.141448 -0.004631
N  0.163542 -1.650178 0.00366
N  1.011131 0.6578 -0.002031
N  -1.572415 1.494965 -0.007072
N  2.429933 0.486115 0.004093
C  -2.242698 -1.008671 -0.007498
C  -1.233441 -2.209475 0.005591
C  0.052137 -0.350735 -0.000556
H  -2.878602 -0.96933 -0.908237
H  -2.895014 -0.961487 0.880808
H  -1.352805 -2.839384 0.903123
H  -1.349509 -2.856517 -0.879885
H  0.703118 1.638372 -0.005443
