program: Gaussian 09
title: 000150761
version: EM64L-G09RevD.01
frameworkgroup: C1[X(C16H12N2)]
method: RPBEPBE
basis: SDD
operation: Freq
keyword: #pfreq=noraman
keyword: PBEPBE/SDD
title: #p freq=noraman PBEPBE/SDD
converged: NO YES NO NO
title: Mulliken charges:
elementType: N N C C C C C C C C C C C C C C C C H H H H H H H H H H H H
charge: -0.035403 -0.116793 -0.152039 0.422192 0.352836 -0.402276 -0.379606 -0.315651 -0.237604 -0.390589 -0.179175 -0.373293 0.329534 -0.389550 -0.389486 -0.204126 -0.204174 -0.256343 0.237695 0.284473 0.245334 0.234108 0.286574 0.232490 0.244493 0.242207 0.242197 0.223115 0.223112 0.225750
chargesum: 0.00000
title: Mulliken charges with hydrogens summed into heavy atoms:
elementType: N N C C C C C C C C C C C C C C C C
charge: -0.035403 -0.116793 -0.152039 0.422192 0.352836 -0.164581 -0.095133 -0.070317 -0.003496 -0.104015 0.053315 -0.128800 0.329534 -0.147343 -0.147289 0.018988 0.018938 -0.030594
polarizability: 3.07849175e+02 -4.13044794e+00 1.80986995e+02 -1.12794406e-02 -1.90556249e-02 1.12847005e+02
1716.lowfreq: -73.5531 -2.2167 -1.5960 -0.0005 -0.0002 0.0006 5.9691 47.6666 48.0830
frequency: -73.5525 47.6666 48.0445 60.3343 152.4276 153.9160 181.7486 210.9381 262.2386 307.0996 389.8003 406.7060 428.2375 447.8642 472.2202 492.0203 506.8307 545.2553 552.0393 564.5206 613.7115 633.8241 652.0645 695.2733 734.7138 760.7952 773.2726 801.7575 807.0580 829.0390 832.3209 853.7570 869.4268 898.0066 936.9603 951.1673 960.6750 981.6543 983.2984 988.6305 1000.4608 1014.6103 1016.6588 1023.6480 1032.8822 1075.0812 1077.9337 1141.1037 1168.4973 1168.6751 1178.5522 1192.4777 1218.6170 1241.9169 1267.8852 1306.1752 1330.8964 1349.4984 1370.8744 1378.4718 1401.7045 1425.9466 1434.6429 1454.8903 1471.4629 1496.5024 1562.0381 1578.8941 1587.1711 1604.3791 1611.0891 1627.4063 3040.7660 3122.4837 3123.2210 3123.7310 3129.7367 3131.2804 3144.7973 3146.6447 3153.0298 3162.5189 3165.9130 3166.3497
redmass: 4.1027 5.4277 4.9962 4.3169 3.7074 5.1135 4.2691 6.1439 3.2053 5.1374 3.6742 3.3848 4.5801 4.5562 3.1733 6.2641 6.1755 3.7018 7.3486 3.7457 6.4271 7.0426 3.1537 2.0243 3.7016 2.1437 1.2717 5.3342 1.9771 5.7774 1.2442 2.2994 3.9776 1.5724 1.3421 1.4404 1.3665 1.9904 2.3218 1.3771 1.4015 1.5256 3.6797 2.2776 2.5057 2.1094 1.5316 1.3377 1.5107 1.0514 1.1429 1.8842 2.0157 1.7723 2.0587 1.3758 1.8123 3.3233 5.9980 2.4828 2.1242 2.8240 2.4038 2.6458 2.4857 4.0126 6.7766 6.1716 5.7033 6.2006 7.4678 7.6101 1.0901 1.0843 1.0884 1.0883 1.0880 1.0911 1.0912 1.0923 1.0963 1.0983 1.1014 1.0992
irintensity: 1.7431 0.9653 2.5358 0.3877 1.3279 2.0490 6.4249 0.4574 14.5494 0.3667 0.7304 2.3339 12.4878 0.0020 1.0167 6.0055 3.8720 15.5894 6.2429 1.0894 0.0417 12.5543 0.0436 35.8346 28.5047 41.7476 3.1599 5.0524 70.1729 47.6103 0.0028 47.4163 21.9254 9.8618 0.0032 0.3293 0.0046 0.5818 0.0826 1.5799 0.5200 17.1063 16.7270 7.7545 3.7495 3.2576 7.7214 11.7022 40.5198 0.3666 0.4598 44.1664 2.4485 3.4120 36.9745 0.1165 13.5083 0.4859 2.7740 27.2179 0.0922 9.0318 2.0843 1.0343 59.6400 43.8182 53.4700 5.1915 5.6303 105.8812 54.9656 144.5062 7.0193 3.5386 8.6957 6.9209 6.8405 13.8120 11.3935 20.8364 32.4626 22.8203 30.8507 23.0949
temp: 298.150 k
press: 1.00000 atm
elementType: 7 7 6 6 6 6 6 6 6 6 6 6 6 6 6 6 6 6 1 1 1 1 1 1 1 1 1 1 1 1
symmnumber: 1
zpe: 611344.6 jmol-1
zpe.correction: 0.232849 hartree
zpe.thermalcorrener: 0.245903 hartree
zpe.thermalcorrenthalpy: 0.246847 hartree
zpe.thermalcorrgfe: 0.192098 hartree
zpe.sumelectzpe: -725.179682 hartree
zpe.sumelectthermal: -725.166628 hartree
zpe.sumelectthermalent: -725.165684 hartree
zpe.sumelectthermalfe: -725.220433 hartree
dipole: -3.8788 -0.1902 0.0002
dipole: 3.8835
quadrupole: -81.4270 -98.6659 -102.6954
quadrupole: -3.2892 -0.0032 -0.0067
quadrupole: 12.8357 -4.4031 -8.4327 -3.2892 -0.0032 -0.0067
hfenergy: -725.4125309 hartree
pointgroup: C01 [X(C16H12N2)]
dipole: 1.5260177 0.0755935 0.0001742 debye
polarizability: 307.8532753|-4.066991|180.9827809|0.010478|0.0899413|112.8471191 unknown
InChI: InChI=1S/C16H12N2/c1-2-9-15(10-3-1)18-12-14-7-4-6-13-8-5-11-17-16(13)14/h1-12H
charge 0 multiplicity 1
30 atoms
N  1.84389 1.656569 0.00151
N  -1.499411 -0.810249 -0.000547
C  2.061114 0.284213 0.000504
C  3.398104 -0.283094 0.000068
C  0.919237 -0.602434 -0.000125
C  3.561766 -1.704537 -0.000962
C  1.129284 -1.992756 -0.001125
C  4.506689 0.625378 0.00068
C  2.442213 -2.543315 -0.001542
C  -0.446472 -0.035073 0.000256
C  4.271422 2.001007 0.001665
C  2.918018 2.468499 0.002058
C  -2.820491 -0.270738 -0.000071
C  -3.498596 -0.039768 -1.227437
C  -3.497562 -0.039164 1.227754
C  -4.830049 0.429547 -1.2203
C  -4.829045 0.430104 1.221519
C  -5.504149 0.666871 0.000838
H  4.575123 -2.124324 -0.001274
H  0.245149 -2.639421 -0.001595
H  5.528422 0.227692 0.000369
H  2.571016 -3.630995 -0.002323
H  -0.505424 1.067284 0.001274
H  5.095551 2.721117 0.002147
H  2.708105 3.54494 0.002837
H  -2.978173 -0.234716 -2.171304
H  -2.976354 -0.233652 2.171287
H  -5.341074 0.610509 -2.173137
H  -5.339276 0.611482 2.174701
H  -6.537926 1.029125 0.001177
