program: Gaussian 09
title: 000150745
version: EM64L-G09RevD.01
frameworkgroup: C1[X(C3H8N2O2)]
method: RPBEPBE
basis: SDD
operation: Freq
keyword: #pfreq=noraman
keyword: PBEPBE/SDD
title: #p freq=noraman PBEPBE/SDD
converged: NO YES NO NO
title: Mulliken charges:
elementType: O O N N C C C H H H H H H H H
charge: -0.424508 -0.302331 -0.045788 0.059023 -0.339001 -0.315010 -0.639529 0.234343 0.247792 0.247269 0.227797 0.235936 0.213098 0.228985 0.371925
chargesum: 0.00000
title: Mulliken charges with hydrogens summed into heavy atoms:
elementType: O O N N C C C
charge: -0.052583 -0.302331 -0.045788 0.059023 0.143134 0.160055 0.038490
polarizability: 7.04660093e+01 -7.06545248e+00 5.59598817e+01 2.97771351e+00 2.11141623e-01 4.13259662e+01
1716.lowfreq: -10.9509 0.0003 0.0006 0.0007 4.2961 18.9958 69.1024 96.5681 147.0444
frequency: 69.0521 96.4925 147.0183 215.4399 270.9908 319.2498 348.6424 391.5394 516.7473 578.3662 625.0764 785.6290 823.5307 926.1734 967.2732 997.5156 1011.4061 1082.6416 1142.1777 1193.7915 1264.4555 1307.3055 1326.2093 1349.9536 1354.7730 1392.7374 1404.8875 1440.0791 1465.7294 1473.6335 1481.8926 2990.1383 2999.0141 3004.1379 3071.0389 3090.6594 3101.8848 3120.9512 3504.1695
redmass: 3.2810 2.5268 4.4362 1.2411 3.5300 2.7094 5.0532 2.6928 3.1210 1.3713 3.5662 1.1996 5.4375 1.9346 3.4313 2.3310 2.6935 2.0498 1.5585 2.4258 2.0007 2.6358 1.3785 1.3801 1.5042 1.2122 1.1598 1.0773 1.0725 1.0418 1.0580 1.0360 1.0650 1.0633 1.0996 1.0987 1.1022 1.0987 1.0649
irintensity: 1.9744 12.0691 2.1635 1.3719 0.3912 9.9114 7.6866 1.6073 39.9685 156.1857 3.6150 20.8558 26.4065 26.2089 87.9262 31.2405 152.1043 15.5152 79.6138 44.2134 32.7125 72.9932 8.3967 34.0483 1.9691 3.4965 34.8290 11.0399 6.7216 13.9843 11.9753 15.8541 47.1745 19.0860 1.4559 37.5062 27.4937 12.8291 12.8732
temp: 298.150 k
press: 1.00000 atm
elementType: 8 8 7 7 6 6 6 1 1 1 1 1 1 1 1
symmnumber: 1
zpe: 314931.3 jmol-1
zpe.correction: 0.119951 hartree
zpe.thermalcorrener: 0.128044 hartree
zpe.thermalcorrenthalpy: 0.128988 hartree
zpe.thermalcorrgfe: 0.087240 hartree
zpe.sumelectzpe: -378.410419 hartree
zpe.sumelectthermal: -378.402326 hartree
zpe.sumelectthermalent: -378.401381 hartree
zpe.sumelectthermalfe: -378.443130 hartree
dipole: -3.6410 1.5764 0.5463
dipole: 4.0051
quadrupole: -40.6429 -50.0001 -41.2546
quadrupole: 0.6802 1.1262 2.3783
quadrupole: 3.3229 -6.0342 2.7113 0.6802 1.1262 2.3783
hfenergy: -378.5303697 hartree
pointgroup: C01 [X(C3H8N2O2)]
dipole: -1.0226972 0.8129415 0.8809567 debye
dipolederiv: -0.8332572 0.0576588 -0.1768593 0.0132047 -0.3812114 0.1917276 0.0203574 0.2222091 -0.4601767 -0.4990967 0.4387776 0.3250676 0.3000454 -0.8058126 -0.5382137 -0.0473514 0.0435426 -0.325267 -0.4878747 0.0929729 0.0207582 0.1705363 -0.4457367 -0.1187977 0.243533 -0.483396 -0.751173 0.1347676 -0.3919702 -0.312739 -0.3338093 0.6520656 0.7729912 -0.3172196 0.6017686 0.6001072 0.4209305 -0.1497573 -0.0896654 -0.1539977 0.4558046 0.0588288 -0.0364297 0.0091413 0.0709484 0.8786904 0.0290942 0.1703128 -0.001935 0.3507621 -0.173517 0.0711313 -0.1135751 0.5236747 -0.0700512 0.0260546 0.0741714 0.0230499 -0.0214188 -0.0133314 0.0698554 0.0050267 0.0634505 -0.0637037 -0.0649 -0.0124967 -0.0196841 -0.0712311 -0.0652802 -0.0372665 -0.091257 0.0721063 0.0580387 0.0406679 -0.0006498 0.0300212 0.0750261 0.0120623 -0.0236167 0.0893835 -0.0671572 -0.0478344 -0.073348 -0.0175011 -0.0828886 -0.0863969 0.0877867 -0.0263392 -0.02244 0.0531675 0.0403961 0.0201452 0.0436642 0.0574544 0.0480097 -0.0921799 0.055839 -0.0654146 -0.01724 -0.0038047 -0.078483 -0.0201777 -0.1244235 0.0019029 -0.0548483 -0.0554687 -0.0712373 0.0438086 0.0642392 0.0039339 -0.0744614 -0.007731 0.0860844 0.0792987 -0.021273 0.0700343 -0.1303837 0.0115327 0.1198875 0.0320219 0.1239065 -0.1043198 -0.0081667 0.0191858 -0.0033693 0.097752 0.3970274 -0.070734 0.0385543 0.0062509 0.2464719 -0.1383604 0.0850629 -0.1904166 0.2263824 unknown
polarizability: 54.9782004|-13.2582857|56.637634|-2.7104275|9.341627|56.1360228 unknown
InChI: InChI=1S/C3H8N2O2/c1-2-5(3-6)4-7/h6H,2-3H2,1H3
charge 0 multiplicity 1
15 atoms
O  2.39415 -0.231697 0.704968
O  1.130824 -1.385222 -1.590336
N  0.253726 0.26427 -0.360872
N  0.369997 -0.332078 -1.597954
C  -0.505676 1.5303 -0.306712
C  0.953999 -0.319683 0.814809
C  -1.820937 1.410287 0.490096
H  0.145497 2.310417 0.131007
H  -0.71045 1.807208 -1.355112
H  0.61517 -1.369805 0.913699
H  0.673416 0.26679 1.701394
H  -2.489765 0.662281 0.030591
H  -1.6412 1.118079 1.54067
H  -2.341127 2.384785 0.497835
H  2.667075 -0.852333 -0.023781
