program: Gaussian 09
title: 000150742
version: EM64L-G09RevD.01
frameworkgroup: C1[X(C21H12O)]
method: RPBEPBE
basis: SDD
operation: Freq
keyword: #pfreq=noraman
keyword: PBEPBE/SDD
title: #p freq=noraman PBEPBE/SDD
converged: NO NO NO NO
title: Mulliken charges:
elementType: O C C C C C C C C C C C C C C C C C C C C C H H H H H H H H H H H H
charge: -0.152705 0.119595 0.119587 0.213024 0.213037 0.246062 0.246061 -0.306627 0.426401 0.426405 -0.457604 -0.457602 -0.472412 -0.472413 -0.417057 -0.417057 -0.444732 -0.444729 -0.255205 -0.255207 -0.247531 -0.247530 0.278782 0.278779 0.245842 0.245840 0.283094 0.283096 0.245257 0.245256 0.233380 0.233381 0.232767 0.232765
chargesum: 0.00000
title: Mulliken charges with hydrogens summed into heavy atoms:
elementType: O C C C C C C C C C C C C C C C C C C C C C
charge: -0.152705 0.119595 0.119587 0.213024 0.213037 0.246062 0.246061 -0.306627 0.426401 0.426405 -0.178822 -0.178822 -0.226569 -0.226573 -0.133963 -0.133961 -0.199475 -0.199474 -0.021825 -0.021827 -0.014764 -0.014765
polarizability: 3.50913459e+02 2.67602599e-04 3.13168026e+02 -1.29683214e+01 4.46932199e-04 9.55925188e+01
1716.lowfreq: -0.0008 -0.0007 -0.0005 3.4159 4.0365 6.2630 63.1350 65.8706 90.2229
frequency: 63.1348 65.8686 90.2228 96.4506 181.2737 182.5829 204.6846 226.4574 238.6089 278.7038 293.2487 331.4922 379.7824 400.7187 441.9862 450.6847 470.3048 500.3808 503.7265 506.4305 524.6890 553.6362 585.5320 611.8928 621.7561 626.9748 640.0456 681.4122 707.3662 738.8178 762.1984 768.4341 770.5232 802.5104 803.6475 821.7800 830.5216 845.9419 861.8218 886.8467 896.1391 899.4122 908.8144 959.2728 973.1198 983.3041 987.5196 993.0894 995.9870 1007.9790 1031.5543 1034.6343 1047.6968 1122.7336 1145.2712 1147.8981 1164.0226 1173.2919 1186.2169 1201.6540 1233.0538 1233.9458 1245.2788 1265.5588 1280.6794 1351.8848 1373.6713 1385.8100 1386.3377 1397.7568 1421.8223 1428.6763 1435.0298 1453.8142 1457.2015 1522.4654 1529.7722 1569.4439 1574.7120 1581.2677 1589.2058 1621.0416 1625.3628 1629.6817 3124.4518 3124.5435 3133.3360 3133.5090 3136.5340 3137.1839 3156.4791 3157.8625 3158.9427 3159.7247 3174.4070 3185.2177
redmass: 5.0257 4.3165 5.2004 8.5929 4.2593 4.3099 5.2383 6.1980 5.0158 9.2416 4.9333 6.3701 5.5696 3.3914 4.8922 3.5251 4.1424 3.9259 5.6953 5.3100 3.6439 6.6763 3.3071 4.4210 7.1003 6.6835 7.6499 6.1386 4.4683 1.7008 3.6229 1.2389 2.3762 5.0635 2.3700 5.1149 3.9809 1.4820 2.1472 1.7999 1.5306 5.7051 6.2893 1.3726 1.3413 1.4085 1.4054 1.4764 3.5800 1.3802 2.2676 3.1147 2.4215 1.8172 1.3174 1.2890 1.4165 1.1022 1.3230 2.5265 2.7197 2.0197 2.3618 1.8550 1.6785 2.2082 2.7383 5.4307 3.1941 4.9720 3.3933 2.4761 3.7148 2.3011 2.9731 4.3876 4.6663 6.1400 6.7733 7.4334 7.4974 7.7254 6.5567 9.2437 1.0861 1.0862 1.0883 1.0883 1.0900 1.0905 1.0967 1.0977 1.0972 1.0973 1.0968 1.0942
irintensity: 0.0009 1.1916 0.3080 0.5719 0.0264 2.1375 6.2661 0.3461 0.6502 3.9573 0.0552 0.0008 0.5076 5.4308 11.2900 0.1200 0.8730 0.1504 1.9861 0.1149 23.2789 1.2284 0.4276 1.8072 4.6065 0.8169 2.3729 0.8986 0.4466 3.9016 39.9927 6.0203 81.7928 0.1012 53.6914 11.9101 1.0131 3.8398 12.2617 63.1108 0.0698 0.0001 9.4911 7.0877 0.1114 1.4584 0.0612 2.3806 21.8398 1.2662 21.8658 5.2521 1.2592 13.0603 1.1256 0.4816 1.5766 2.0446 2.9149 12.1986 6.8858 11.2231 3.6148 26.6281 0.1697 85.9069 6.2898 1.9293 0.5222 0.4605 2.0021 1.2535 23.6864 29.1253 2.2006 0.0128 11.4641 0.6732 11.8778 56.9754 24.8732 130.9497 4.2878 131.7275 0.8084 0.2033 2.2454 0.2289 23.6506 8.1355 37.8499 30.6924 34.5918 0.3339 4.4251 12.4606
temp: 298.150 k
press: 1.00000 atm
elementType: 8 6 6 6 6 6 6 6 6 6 6 6 6 6 6 6 6 6 6 6 6 6 1 1 1 1 1 1 1 1 1 1 1 1
symmnumber: 1
zpe: 679409.3 jmol-1
zpe.correction: 0.258773 hartree
zpe.thermalcorrener: 0.273872 hartree
zpe.thermalcorrenthalpy: 0.274816 hartree
zpe.thermalcorrgfe: 0.216878 hartree
zpe.sumelectzpe: -881.248695 hartree
zpe.sumelectthermal: -881.233597 hartree
zpe.sumelectthermalent: -881.232653 hartree
zpe.sumelectthermalfe: -881.290590 hartree
dipole: 0.0000 -4.4160 0.0001
dipole: 4.4160
quadrupole: -98.6950 -128.2006 -131.2414
quadrupole: 0.0001 -2.6337 0.0001
quadrupole: 20.6840 -8.8216 -11.8624 0.0001 -2.6337 0.0001
hfenergy: -881.5074686 hartree
pointgroup: C01 [X(C21H12O1)]
dipole: 0.0000232 1.737381 0.0000101 debye
polarizability: 350.7322197|-0.0011372|313.1680255|14.6430407|0.0056471|95.773758 unknown
InChI: InChI=1S/C21H12O/c22-21-17-11-9-13-5-1-3-7-15(13)19(17)20-16-8-4-2-6-14(16)10-12-18(20)21/h1-12H
charge 0 multiplicity 1
34 atoms
O  -0.000054 -4.005947 -0.000063
C  -0.752481 -0.486787 -0.050201
C  0.752484 -0.486806 0.050315
C  -1.175277 -1.832488 -0.201934
C  1.17525 -1.832534 0.201931
C  -1.754129 0.537557 0.084671
C  1.754144 0.537517 -0.084536
C  -0.000027 -2.743853 -0.000031
C  -3.142671 0.162992 -0.190249
C  3.142684 0.162918 0.190325
C  -2.520288 -2.205197 -0.425288
C  2.52026 -2.205273 0.42523
C  -3.490052 -1.198524 -0.475619
C  3.490038 -1.198617 0.475635
C  -1.505993 1.87083 0.563252
C  1.506016 1.870815 -0.563068
C  -4.165497 1.165586 -0.111516
C  4.165527 1.165495 0.111595
C  -2.534536 2.809765 0.666878
C  2.534569 2.80974 -0.666667
C  -3.871641 2.468558 0.29185
C  3.871674 2.468501 -0.291656
H  -2.775371 -3.261312 -0.559403
H  2.775335 -3.261399 0.559281
H  -4.537873 -1.442391 -0.684767
H  4.537862 -1.442522 0.684732
H  -0.505539 2.139235 0.909165
H  0.505563 2.139237 -0.908959
H  -5.198142 0.880575 -0.344842
H  5.198181 0.880444 0.344845
H  -2.316207 3.812198 1.051509
H  2.31625 3.812203 -1.051225
H  -4.66756 3.218374 0.359027
H  4.667601 3.218312 -0.358818
