program: Gaussian 09
title: 000013518
version: EM64L-G09RevD.01
frameworkgroup: C1[X(C6H2F12O2)]
method: RPBEPBE
basis: SDD
operation: Freq
keyword: #p
keyword: freq=noraman
keyword: PBEPBE/SDD
title: #p freq=noraman PBEPBE/SDD
converged: YES YES NO NO
title: Mulliken charges:
elementType: F F F F F F F F F F F F O O C C C C C C H H
charge: -0.139631 -0.133393 -0.114293 -0.103480 -0.156973 -0.126529 -0.111293 -0.126566 -0.132894 -0.099531 -0.155961 -0.116081 -0.382167 -0.384885 -0.061009 -0.039289 0.387540 0.409831 0.423834 0.363207 0.402960 0.396603
chargesum: 0.00000
title: Mulliken charges with hydrogens summed into heavy atoms:
elementType: F F F F F F F F F F F F O O C C C C C C
charge: -0.139631 -0.133393 -0.114293 -0.103480 -0.156973 -0.126529 -0.111293 -0.126566 -0.132894 -0.099531 -0.155961 -0.116081 0.020793 0.011718 -0.061009 -0.039289 0.387540 0.409831 0.423834 0.363207
polarizability: 8.20515115e+01 -3.65421259e-01 7.57063228e+01 -1.23364634e+00 9.15321866e-01 7.81245534e+01
1716.lowfreq: -13.0179 -5.6452 -0.0006 0.0006 0.0006 7.4645 46.1366 59.6804 77.0397
frequency: 46.1261 59.6615 77.0378 104.2589 110.0890 144.8234 152.5666 165.1194 181.4537 187.1806 207.5342 233.2866 250.9603 259.2966 269.2322 277.8418 288.8161 292.2901 293.2380 303.9278 315.3261 332.7088 337.5980 337.9897 408.5455 447.5358 457.3698 461.3698 466.7808 483.6351 493.5381 495.3608 543.7037 594.1761 620.0685 635.3444 645.9703 666.4177 779.2680 798.0957 882.5461 981.8982 983.9996 1006.9041 1010.5258 1022.0284 1037.4994 1055.3586 1068.6829 1074.2081 1094.5259 1104.0554 1112.7096 1134.8551 1142.7685 1159.1792 1303.4847 1311.7468 3525.2848 3540.5613
redmass: 17.3815 17.7488 16.3105 18.2273 17.6593 13.2040 15.7399 14.3238 13.1753 16.7472 12.5592 15.9880 9.6696 4.5226 6.4536 5.1082 9.6707 2.8393 13.0528 4.1536 3.2237 3.2983 5.7320 3.0340 13.0229 16.6988 16.9418 13.5688 16.6387 17.5277 17.1620 17.2375 13.8863 14.2162 12.8952 15.7275 14.6514 16.9139 8.5462 8.2584 9.3150 7.7963 6.5175 10.7996 12.8719 8.7652 9.0042 12.2090 6.7486 11.5182 8.0262 10.6523 11.5173 10.0161 10.5699 11.5861 1.5665 1.5461 1.0664 1.0660
irintensity: 0.0917 0.6649 1.3866 0.1314 0.8685 2.1814 1.1682 1.9068 3.3031 0.3194 0.9575 7.3588 6.0226 61.0226 12.6420 31.8995 8.3597 45.9001 10.1052 35.9295 30.9560 47.9996 15.3768 43.8167 13.1134 22.2494 8.0391 0.8543 5.5745 1.2260 0.9688 0.0580 5.9625 21.9560 44.2021 12.7744 33.3755 1.1067 117.3791 61.2749 17.7062 90.0383 66.9795 3.9525 63.1488 4.4503 56.8594 65.1976 253.2002 299.9288 256.3222 537.3495 259.5364 209.2637 50.2688 43.0882 4.2643 71.8117 64.2163 71.5017
temp: 298.150 k
press: 1.00000 atm
elementType: 9 9 9 9 9 9 9 9 9 9 9 9 8 8 6 6 6 6 6 6 1 1
symmnumber: 1
zpe: 243908.8 jmol-1
zpe.correction: 0.092900 hartree
zpe.thermalcorrener: 0.112472 hartree
zpe.thermalcorrenthalpy: 0.113416 hartree
zpe.thermalcorrgfe: 0.046570 hartree
zpe.sumelectzpe: -1576.779183 hartree
zpe.sumelectthermal: -1576.759611 hartree
zpe.sumelectthermalent: -1576.758666 hartree
zpe.sumelectthermalfe: -1576.825512 hartree
dipole: 1.6076 0.5927 -0.1480
dipole: 1.7197
quadrupole: -116.7301 -116.0317 -105.8651
quadrupole: -1.9816 -4.0574 4.4798
quadrupole: -3.8544 -3.1561 7.0105 -1.9816 -4.0574 4.4798
hfenergy: -1576.8720827 hartree
pointgroup: C01 [X(C6H2F12O2)]
dipole: 0.6275255 0.2468216 -0.0553532 debye
dipolederiv: -0.3239751 -0.0732682 -0.0672829 -0.0692689 -0.3734231 -0.1732208 0.0034187 -0.0876453 -0.730694 -0.7688885 0.0114064 0.1854977 -0.0727033 -0.3544555 0.0031103 0.1866546 -0.0288718 -0.3187458 -0.3844308 0.0706783 -0.0550884 0.1696958 -0.6325545 0.176122 -0.0990291 0.1581329 -0.3212934 -0.4094485 -0.0594318 0.0399001 -0.1990844 -0.6503151 0.1585329 0.0772724 0.1506994 -0.2727295 -0.5022418 0.1206039 0.2331462 0.1714931 -0.3692566 -0.1063252 0.1758434 -0.0423392 -0.584298 -0.5082412 -0.0653217 -0.2692059 -0.0228083 -0.3641604 -0.0442955 -0.2467109 -0.1033867 -0.497117 -0.4991069 -0.1684605 0.2232431 -0.2134498 -0.3924121 0.149265 0.1639716 0.0745977 -0.4708628 -0.4803048 0.0839735 0.064184 0.2047893 -0.5932732 -0.1763993 0.1303694 -0.1908203 -0.3320273 -0.4700451 0.0888114 -0.2234656 0.0397709 -0.3923974 0.0644306 -0.2203041 0.118075 -0.4913925 -0.3071667 0.0804697 -0.0677281 0.0650574 -0.4057012 0.2500866 0.0094458 0.1594175 -0.6048104 -0.4190049 -0.0284474 -0.0771434 -0.1172858 -0.5708549 -0.215157 -0.1549634 -0.1917464 -0.4569443 -0.7628379 -0.0672438 0.1661686 0.0266836 -0.3369033 -0.0064508 0.1709128 0.0310579 -0.2967954 -0.2498418 -0.0724692 0.0462597 -0.060266 -0.5130103 -0.0162505 0.0132235 -0.0398098 -0.7661144 -0.5508033 0.1282074 0.0017527 0.0722976 -0.2018351 -0.0024008 0.0460317 0.0026718 -0.7220001 0.0892356 0.0300681 0.0609494 0.0360253 0.0661165 0.0858638 -0.0441091 0.0844696 0.4508033 0.2430414 -0.0399843 0.0304325 -0.0308576 -0.0827229 -0.0458422 -0.1263542 -0.0458875 0.4658049 1.4059746 -0.0162366 -0.0919905 -0.0035554 1.3766189 -0.0711262 -0.0541678 -0.0255374 1.2775797 1.4150876 0.0010786 -0.0621219 0.0333407 1.3783816 0.0258079 0.0272128 -0.0095045 1.2538262 1.4613781 0.037362 -0.0594034 0.0115754 1.4424426 -0.0540753 -0.0099934 0.0344192 1.3162527 1.4532718 -0.0000446 -0.0562034 0.0065163 1.3685937 0.0525863 -0.0278537 -0.0182954 1.2838375 0.169964 0.0193325 0.0243992 0.0170785 0.4146216 -0.029145 0.0094039 -0.0097581 0.40469 0.398384 -0.0810839 -0.0462996 -0.0650444 0.1865007 -0.0251168 -0.0302749 -0.0199387 0.4130307 unknown
polarizability: 81.983154|-0.1399342|75.5592849|-1.3758261|0.6762196|78.3399489 unknown
InChI: InChI=1S/C6H2F12O2/c7-3(8,9)1(19,4(10,11)12)2(20,5(13,14)15)6(16,17)18/h19-20H
charge 0 multiplicity 1
22 atoms
F  1.641455 1.703691 1.239842
F  2.805849 1.259356 -0.671144
F  0.909038 2.454698 -0.765209
F  1.104631 -2.325839 0.576664
F  2.510449 -1.526797 -0.99526
F  2.574711 -0.741983 1.13769
F  -2.436715 -1.779791 0.664017
F  -0.888921 -2.281707 -0.884243
F  -2.409124 -0.693868 -1.323476
F  -1.673207 1.863165 -0.941811
F  -1.01291 2.194654 1.208798
F  -2.859601 0.98591 0.770028
O  0.455976 -0.078949 -1.783375
O  -0.495294 -0.429992 1.729957
C  0.72143 0.014645 -0.381389
C  -0.69044 -0.075926 0.349728
C  1.509287 1.373094 -0.122855
C  1.704503 -1.163584 0.121243
C  -1.59752 -1.226682 -0.302933
C  -1.565203 1.251719 0.297557
H  1.271292 -0.32887 -2.292909
H  -0.257989 0.370856 2.269881
