program: Gaussian 09
title: 000150605
version: EM64L-G09RevD.01
frameworkgroup: C1[X(C12H9N3O2)]
method: RPBEPBE
basis: SDD
operation: Freq
keyword: #p
keyword: freq=noraman
keyword: PBEPBE/SDD
title: #p freq=noraman PBEPBE/SDD
converged: YES YES NO YES
title: Mulliken charges:
elementType: O O N N N C C C C C C C C C C C C H H H H H H H H H
charge: -0.171916 -0.231134 -0.199322 0.009941 0.076670 0.327286 -0.163592 0.322109 0.432386 -0.372544 0.088981 -0.442693 -0.400779 -0.612538 -0.427097 -0.233121 -0.236831 0.238008 0.243679 0.281323 0.269000 0.220220 0.269010 0.244186 0.236060 0.232709
chargesum: 0.00000
title: Mulliken charges with hydrogens summed into heavy atoms:
elementType: O O N N N C C C C C C C C C C C C
charge: -0.171916 -0.231134 -0.199322 0.009941 0.076670 0.327286 -0.163592 0.322109 0.432386 -0.134535 0.088981 -0.199015 -0.119456 0.145692 -0.182911 0.002940 -0.004122
polarizability: 3.07111067e+02 -1.11125035e-01 1.80807628e+02 3.15148900e-03 1.92389200e-02 6.32977201e+01
1716.lowfreq: -5.3204 -0.0005 -0.0002 0.0005 4.7656 7.3476 34.0067 75.3608 85.1959
frequency: 33.9921 75.3582 85.1934 136.6351 149.4798 166.3780 203.0435 260.1511 281.9957 303.8228 337.8443 339.2936 419.4478 422.4235 471.2073 507.7406 518.5627 562.7649 595.4423 608.6127 629.7933 689.3606 689.7363 695.5340 710.1245 760.8927 762.9100 800.7548 813.3285 818.6244 870.8159 894.9850 957.2191 975.6940 977.5055 1001.5486 1027.0498 1077.5186 1104.0027 1121.6917 1145.5206 1153.1012 1175.3268 1176.1001 1228.1674 1244.1519 1286.5263 1295.0298 1348.1891 1360.7956 1378.9728 1388.7542 1401.4164 1427.2958 1447.7257 1460.0749 1464.8072 1476.7482 1480.7152 1542.0756 1563.7865 1598.6431 1634.3933 3022.5524 3123.7097 3126.4031 3129.0865 3134.1888 3140.4585 3156.6337 3162.3316 3170.2672
redmass: 8.1170 6.0232 3.4583 7.5407 1.1366 4.0699 4.3780 6.7736 5.1490 4.0426 5.9291 6.1469 7.7855 3.1003 5.6863 7.1232 3.7202 3.3960 7.8388 7.9801 5.8635 6.0208 11.8934 7.4568 3.3020 7.7148 1.2921 6.7374 3.4203 1.5936 4.9783 1.6162 1.3521 4.8023 1.4103 1.3490 2.2020 3.3051 2.2409 1.3174 1.8091 1.8993 2.9917 1.0953 1.8525 3.1911 2.3567 3.1217 4.5751 8.7081 3.6161 4.0629 5.9513 2.5099 1.9383 1.0402 1.7819 2.0151 1.6295 4.7419 6.3999 7.0472 7.1298 1.0328 1.1023 1.0870 1.1027 1.0878 1.0894 1.0947 1.0965 1.1002
irintensity: 0.5663 0.0892 5.3639 1.6500 0.7421 0.2864 0.5298 3.8423 2.9872 0.8950 0.7733 0.0320 0.2786 5.6960 1.3839 0.3659 1.1424 3.3263 6.3799 12.9657 1.1965 4.2204 0.2598 8.7830 12.1436 9.3764 30.1099 8.6795 0.0080 93.2423 4.9357 0.7239 0.0002 0.7075 5.0678 0.2013 9.8609 3.6657 3.0268 0.6576 53.9711 116.7809 274.0902 5.3916 26.3573 45.4793 89.5449 56.9041 107.5796 173.5189 37.3240 7.7844 3.6577 15.4690 12.7477 14.1693 7.9131 17.1524 28.5279 12.9295 10.8514 28.0692 7.2546 23.1995 7.4674 1.6103 9.2582 1.7934 11.5104 18.6264 17.4123 23.5668
temp: 298.150 k
press: 1.00000 atm
elementType: 8 8 7 7 7 6 6 6 6 6 6 6 6 6 6 6 6 1 1 1 1 1 1 1 1 1
symmnumber: 1
zpe: 500651.7 jmol-1
zpe.correction: 0.190688 hartree
zpe.thermalcorrener: 0.203863 hartree
zpe.thermalcorrenthalpy: 0.204807 hartree
zpe.thermalcorrgfe: 0.150268 hartree
zpe.sumelectzpe: -776.131391 hartree
zpe.sumelectthermal: -776.118216 hartree
zpe.sumelectthermalent: -776.117271 hartree
zpe.sumelectthermalfe: -776.171810 hartree
dipole: -4.2491 5.6378 -0.0012
dipole: 7.0597
quadrupole: -100.3617 -90.4600 -100.0210
quadrupole: 14.4242 -0.0153 -0.0079
quadrupole: -3.4141 6.4876 -3.0734 14.4242 -0.0153 -0.0079
hfenergy: -776.3220787 hartree
pointgroup: C01[X(C12H9N3O2)]
dipole: 1.7115677 2.1867969 0.0546758 debye
dipolederiv: -0.5976711 -0.1675608 -0.0042359 -0.6020155 -0.8691265 -0.0159019 -0.0145618 -0.0155899 -0.1979697 -1.1669354 0.0690235 0.0006964 0.3856723 -0.5281445 -0.0063629 0.0082137 -0.0066199 -0.2371762 -0.2666364 0.2750131 0.00664 0.5365197 -0.2756618 -0.0044838 0.0126014 -0.0047381 -0.0863204 0.205988 0.3856348 0.0096314 0.0903683 -0.3175795 -0.0028127 0.0026927 -0.0024936 -0.2051707 2.4150158 0.3563417 0.0103934 0.6320771 1.3050969 0.0265193 0.0170297 0.0265337 0.1654026 0.1571745 -0.1932314 -0.0047374 0.4561369 -0.0396705 -0.0028168 0.0111636 -0.0029649 0.0767015 0.0280634 -0.0782046 -0.0018571 -0.4382235 -0.213196 -0.0052595 -0.0107795 -0.00511 -0.005705 0.3017227 -0.0016749 0.0000675 -0.2303673 0.0268196 0.0000993 -0.0055239 0.000098 0.0204109 0.0567977 -0.008897 -0.0002317 -0.1997004 -0.2478782 -0.0071529 -0.0049811 -0.007073 0.0407632 -0.3180472 0.1086726 0.0026851 0.046227 0.1023367 0.0071371 0.0012721 0.0071747 -0.1894841 -1.2829225 -0.4702513 -0.0121763 -0.6364964 0.3612505 0.0056878 -0.0160852 0.0054227 0.1356732 0.1202057 -0.1007636 -0.0024405 -0.1221053 0.2576419 0.0100141 -0.0029404 0.0100035 -0.1501908 -0.3039047 0.0809794 0.0019006 0.2072217 0.0401856 0.0042673 0.0051251 0.0042234 -0.1318752 0.3177089 -0.1160746 -0.0026275 -0.2108844 0.3045547 0.0029085 -0.0048492 0.0028748 0.185952 -0.0572278 -0.0253324 -0.0006901 0.2860499 0.1165248 0.0069973 0.0069497 0.0069259 -0.166894 0.1654156 -0.014852 -0.000332 0.0430148 0.1554122 0.0074935 0.0010002 0.007484 -0.1474779 0.1078698 0.0035427 0.0000358 -0.1697859 -0.1673673 -0.000313 -0.0041835 -0.0002748 -0.1563241 0.0494706 0.0959601 0.0023214 0.0317752 -0.05895 -0.0056658 0.0006888 -0.0056312 0.1717795 0.0028929 -0.1158835 -0.0028713 -0.0468261 -0.0205568 -0.0042999 -0.0011921 -0.0043044 0.1537679 0.059064 -0.0855781 -0.0020894 -0.0344768 0.0270703 -0.0032143 -0.0008449 -0.0032342 0.157981 0.0164003 0.0499541 0.0648816 -0.0073527 0.0730636 0.0421033 0.0638 -0.0013953 -0.0124798 0.0546948 -0.1532973 -0.0041792 -0.0152831 -0.0675552 -0.0048299 -0.0005912 -0.004875 0.1166261 0.0166415 0.0532517 -0.0621335 -0.003609 0.074681 -0.0374391 -0.0641682 0.0062385 -0.0147223 0.0195502 -0.0521885 -0.001268 -0.1273659 -0.047387 -0.0050011 -0.0030577 -0.0049902 0.1564697 0.0427607 0.0750966 0.0018535 0.099791 -0.079453 -0.0058433 0.0024717 -0.0058552 0.1579719 -0.1440918 0.03032 0.0007633 0.0296382 0.0878882 -0.0018309 0.0007499 -0.0018294 0.1622909 unknown
polarizability: 307.0737539|-2.1738732|180.7749462|0.013429|2.8672357|63.3677149 unknown
InChI: InChI=1S/C12H9N3O2/c1-14-10-7-6-8-4-2-3-5-9(8)11(10)13-12(14)15(16)17/h2-7H,1H3
charge 0 multiplicity 1
26 atoms
O  -3.54913 -2.247223 -0.053021
O  -4.433224 -0.133511 -0.005301
N  -1.855978 0.989077 0.025478
N  -0.976401 -1.143515 -0.026672
N  -3.429112 -0.968133 -0.02346
C  -0.461992 1.119011 0.029206
C  0.059294 -0.215059 -0.003353
C  1.477286 -0.455409 -0.008912
C  2.332612 0.710391 0.019737
C  0.382842 2.266483 0.057669
C  -2.096633 -0.398057 -0.008755
C  1.757572 2.038635 0.052319
C  2.047946 -1.7599 -0.040956
C  -2.811672 2.112825 0.053293
C  3.749792 0.517425 0.014888
C  3.441102 -1.915085 -0.04489
C  4.295781 -0.772245 -0.016896
H  -0.016226 3.284873 0.082532
H  2.443275 2.893717 0.073428
H  1.378198 -2.625302 -0.062215
H  -3.45904 2.050613 0.940997
H  -2.236684 3.051493 0.078782
H  -3.456493 2.097005 -0.838294
H  4.406873 1.394868 0.0363
H  3.879568 -2.91836 -0.069649
H  5.382542 -0.908018 -0.020355
