program: Gaussian 09
title: 000150593
version: EM64L-G09RevD.01
frameworkgroup: C1[X(C17H14N2O)]
method: RPBEPBE
basis: SDD
operation: Freq
keyword: #p
keyword: freq=noraman
keyword: PBEPBE/SDD
title: #p freq=noraman PBEPBE/SDD
converged: YES YES NO NO
title: Mulliken charges:
elementType: O N N C C C C C C C C C C C C C C C C C H H H H H H H H H H H H H H
charge: -0.429181 -0.226890 -0.062805 0.128471 0.142814 0.249925 0.455252 -0.059440 0.411098 0.166426 -0.466233 -0.355667 -0.496731 -0.488718 -0.553187 -0.646376 -0.434242 -0.775561 0.279924 -0.381296 0.242427 0.251414 0.240056 0.239463 0.246127 0.282813 0.242019 0.220487 0.242880 0.228707 0.272817 0.228188 0.254576 0.350444
chargesum: 0.00000
title: Mulliken charges with hydrogens summed into heavy atoms:
elementType: O N N C C C C C C C C C C C C C C C C C
charge: -0.078737 -0.226890 -0.062805 0.128471 0.142814 0.249925 0.455252 -0.059440 0.411098 0.166426 -0.223805 -0.104253 -0.256675 -0.249254 -0.307060 0.098942 -0.191362 -0.045850 0.279924 -0.126720
polarizability: 2.99873295e+02 -4.65088377e+00 2.55176901e+02 1.37428703e+01 2.82614737e+00 9.47355456e+01
1716.lowfreq: -0.0007 -0.0005 -0.0002 0.6403 5.4779 8.0324 63.7781 70.5275 98.2043
frequency: 63.7747 70.5192 98.2026 115.7871 129.1198 150.0864 168.0015 186.5658 234.2578 250.2753 287.6464 303.6944 316.5354 326.3518 353.9763 360.3312 394.3606 416.1128 437.9563 455.6568 482.7560 510.6479 543.7011 556.8855 584.2669 608.0654 628.4417 649.5538 667.2213 673.1569 689.7008 731.4110 744.8453 783.9223 789.8144 805.5760 831.0194 842.4544 853.7046 863.2711 869.2591 952.9618 964.4504 968.9151 978.9202 989.3666 1002.1485 1042.8817 1077.4205 1102.1104 1115.0269 1129.3204 1137.0679 1154.6231 1165.6666 1206.1688 1228.6122 1240.3896 1240.9437 1271.7944 1289.1126 1318.5812 1349.3743 1369.6693 1395.9894 1399.3291 1408.0949 1416.3393 1437.6660 1447.9706 1453.9703 1463.8027 1467.8953 1480.3764 1489.8147 1509.6413 1515.4882 1546.6868 1576.8719 1602.5383 1618.8504 1626.0621 2975.8581 2986.3930 3050.6027 3068.0778 3121.5181 3121.9711 3130.6560 3133.1335 3133.8452 3144.1298 3147.0307 3171.4707 3174.9133 3577.3428
redmass: 4.1265 4.1135 3.5814 1.3485 2.9306 2.1329 1.3450 3.6262 5.0688 3.9904 4.6210 2.7884 4.6462 4.5191 2.9702 1.3537 5.2187 5.0414 3.7595 5.1104 4.5324 4.0422 4.5967 3.6199 4.1469 4.2359 5.2486 5.0640 5.1440 4.2022 5.8920 6.4922 2.7514 5.2301 1.7043 3.3218 1.6691 6.5503 3.1323 1.8193 1.4821 1.3189 1.3791 3.6214 1.4140 2.2367 2.2258 1.4927 3.5721 1.7560 1.3241 1.5344 1.3419 1.5410 1.6245 1.8394 1.6983 2.5076 2.0718 3.1626 3.0233 2.7828 3.4619 3.3207 1.5063 3.0503 3.5571 3.4038 3.1904 1.2423 2.1374 1.1083 1.4491 1.1058 1.1364 4.6188 3.7488 5.2945 7.0249 7.7503 6.6977 6.9985 1.0409 1.0385 1.0960 1.0991 1.0963 1.0861 1.0988 1.0895 1.0889 1.0900 1.0981 1.0966 1.0960 1.0659
irintensity: 0.0782 1.4443 1.1521 1.0886 2.8344 0.9577 0.5389 1.3946 1.2792 5.5793 1.5911 3.7605 1.7546 0.8883 13.7176 129.3069 3.5076 3.9186 4.9775 3.8631 10.9317 2.1606 3.2101 8.3352 5.1694 6.4012 2.3535 3.5512 1.9959 4.4235 10.8838 5.5315 1.2088 1.1393 1.8753 4.2962 3.9287 19.0019 13.2650 85.9369 53.8509 0.8478 1.6723 11.4403 0.7592 2.5368 13.9481 2.8753 14.5126 1.4297 0.3957 145.6106 138.8615 6.3837 10.8726 13.9917 1.4949 4.2060 10.5339 21.8373 20.6917 19.9621 46.2265 22.7197 2.8115 9.5891 25.2383 22.8710 3.1430 18.7134 12.2765 7.7609 6.5008 38.5797 8.8681 26.8949 73.4613 7.1725 10.2729 7.4980 28.2930 72.1415 31.8740 49.7609 19.4294 23.7418 5.0479 0.6754 7.5652 10.7335 7.2460 12.9826 30.7516 14.7501 9.4551 32.7149
temp: 298.150 k
press: 1.00000 atm
elementType: 8 7 7 6 6 6 6 6 6 6 6 6 6 6 6 6 6 6 6 6 1 1 1 1 1 1 1 1 1 1 1 1 1 1
symmnumber: 1
zpe: 699329.4 jmol-1
zpe.correction: 0.266360 hartree
zpe.thermalcorrener: 0.282442 hartree
zpe.thermalcorrenthalpy: 0.283387 hartree
zpe.thermalcorrgfe: 0.223857 hartree
zpe.sumelectzpe: -839.587448 hartree
zpe.sumelectthermal: -839.571367 hartree
zpe.sumelectthermalent: -839.570422 hartree
zpe.sumelectthermalfe: -839.629952 hartree
dipole: 0.4538 -2.5935 1.2513
dipole: 2.9152
quadrupole: -123.4884 -97.8252 -119.6822
quadrupole: 13.5007 -1.2553 -0.0924
quadrupole: -9.8231 15.8400 -6.0169 13.5007 -1.2553 -0.0924
hfenergy: -839.8538089 hartree
pointgroup: C01 [X(C17H14N2O1)]
dipole: -0.2286518 1.0212548 0.4692154 debye
polarizability: 300.2711726|-2.7556105|254.5969829|-13.1248622|-7.0560713|94.9175859 unknown
InChI: InChI=1S/C17H14N2O/c1-10-18-15-8-6-12-4-3-11-5-7-13(20)9-14(11)16(12)17(15)19(10)2/h3-9,20H,1-2H3
charge 0 multiplicity 1
34 atoms
O  -3.098626 3.066875 -0.878567
N  1.73376 1.359641 0.196391
N  3.655247 0.255826 -0.395607
C  0.099679 -0.691608 -0.001967
C  1.350088 0.014125 -0.045617
C  -1.241702 -0.106385 -0.025752
C  0.214448 -2.135925 -0.000948
C  2.57932 -0.652508 -0.362862
C  -2.380564 -0.944595 0.275302
C  3.125623 1.438742 -0.044914
C  1.470501 -2.788113 -0.257015
C  2.637225 -2.06458 -0.498887
C  -0.956848 -2.939198 0.260556
C  -2.197422 -2.362426 0.461342
C  -1.495578 1.238265 -0.443171
C  1.010743 2.388899 0.964004
C  -3.690649 -0.369189 0.292663
C  3.904733 2.70819 0.114595
C  -2.79888 1.758024 -0.454128
C  -3.909333 0.966834 -0.046288
H  1.487223 -3.883661 -0.275312
H  3.589844 -2.548436 -0.732047
H  -0.833742 -4.027207 0.3105
H  -3.071615 -2.979824 0.697682
H  -0.670437 1.84472 -0.831247
H  0.123488 1.948504 1.439033
H  1.669121 2.783497 1.757013
H  0.687572 3.235723 0.33069
H  -4.5419 -1.009874 0.550396
H  3.975532 3.027094 1.172921
H  4.926255 2.530844 -0.253728
H  3.461435 3.544928 -0.456255
H  -4.908183 1.411749 -0.050931
H  -2.281757 3.534848 -1.183346
