program: Gaussian 09
title: 000150572
version: EM64L-G09RevD.01
frameworkgroup: C1[X(C14H12O3)]
method: RPBEPBE
basis: SDD
operation: Freq
keyword: #pfreq=noraman
keyword: PBEPBE/SDD
title: #p freq=noraman PBEPBE/SDD
converged: NO YES NO NO
title: Mulliken charges:
elementType: O O O C C C C C C C C C C C C C C H H H H H H H H H H H H
charge: -0.263990 -0.244798 -0.200312 0.063564 -0.030472 0.163656 0.009896 0.380996 0.454633 0.211996 -0.586224 -0.783895 -0.812143 -0.294699 -0.800816 -0.308871 0.110813 0.243120 0.251905 0.219753 0.251950 0.233457 0.233417 0.256827 0.245804 0.244621 0.253955 0.244662 0.251194
chargesum: 0.00000
title: Mulliken charges with hydrogens summed into heavy atoms:
elementType: O O O C C C C C C C C C C C C C C
charge: -0.263990 -0.244798 -0.200312 0.063564 -0.030472 0.163656 0.009896 0.380996 0.454633 0.211996 -0.343104 -0.060287 -0.088442 -0.048895 -0.057577 -0.057676 0.110813
polarizability: 2.49640119e+02 5.38849629e+00 1.92498700e+02 2.08119547e-03 -7.39385890e-03 7.60048067e+01
1716.lowfreq: -93.5697 -88.4451 -12.7417 -4.6118 -0.0010 -0.0004 0.0005 4.8238 69.0522
frequency: -93.5488 -88.4273 69.0355 84.2000 110.3210 118.0685 140.2664 170.2724 176.1867 219.7772 241.9254 302.3325 308.9572 320.6877 365.2972 377.6194 401.8099 435.5802 476.8318 533.0696 548.7389 555.4594 600.7803 623.5754 626.4509 638.5488 664.7483 703.9100 741.6972 774.3496 785.8007 817.3523 826.2066 878.8248 921.1421 945.9726 977.9046 988.8270 1017.9863 1033.7053 1044.1733 1046.4253 1048.9222 1098.4706 1124.4107 1166.0599 1191.9422 1227.7166 1235.2189 1279.2178 1338.8226 1387.9820 1398.1656 1405.9493 1414.2699 1417.9057 1427.5060 1458.7025 1464.0127 1469.9461 1470.0486 1473.9017 1477.9712 1487.5158 1583.3621 1604.2296 1624.0627 1632.6865 1686.5629 2986.4550 2987.4957 2990.2752 3062.7621 3064.7290 3071.1369 3092.9064 3105.9169 3106.2625 3128.0301 3133.2591 3187.1425
redmass: 1.0192 1.0183 5.0939 3.3380 1.1647 2.9205 4.6291 5.5152 4.4616 2.8909 2.7368 5.3473 4.4860 4.5302 4.3448 7.3450 5.5315 4.3231 6.0156 5.0495 3.8743 5.3091 6.7413 3.9495 3.8020 5.3926 7.5045 5.8768 8.2781 5.8964 5.2322 6.4151 1.4649 1.5024 2.5528 5.4300 2.0821 1.3316 1.5656 1.3847 1.4980 1.5058 3.0553 4.7737 2.4238 2.3211 3.0480 1.4946 2.2170 4.3384 2.7647 2.4753 1.2362 1.4651 1.5206 2.9496 4.4242 1.0433 1.1268 1.0445 1.6386 1.0895 1.0457 2.1714 7.2224 8.2093 7.7783 8.0669 10.7500 1.0379 1.0379 1.0366 1.0983 1.0980 1.0976 1.0999 1.0975 1.0982 1.0918 1.0905 1.0952
irintensity: 0.0849 0.0649 1.7738 4.0414 1.8377 4.3577 3.0978 0.6915 0.6418 0.5692 0.5596 0.1312 0.4315 1.3734 0.4476 5.4551 2.7239 0.0122 1.4494 8.1049 2.5246 8.6793 9.3070 3.2873 0.9285 0.1823 19.0520 2.7026 28.6651 10.6264 15.4000 2.8533 16.7667 47.3360 15.3498 56.1360 29.9855 0.3319 6.6906 6.8307 5.5567 1.7204 14.4411 80.0321 28.7671 7.3642 35.0671 1.2461 27.5643 26.3869 4.0667 38.2387 12.8785 30.1401 34.8346 2.0498 13.8933 28.3044 7.0150 0.2950 3.3101 7.0836 15.9667 42.8623 45.6096 58.6428 69.5075 52.5837 529.4308 23.9931 33.7192 21.5224 12.3937 17.5626 11.3590 21.4167 6.9657 6.4457 4.7899 16.4627 3.2027
temp: 298.150 k
press: 1.00000 atm
elementType: 8 8 8 6 6 6 6 6 6 6 6 6 6 6 6 6 6 1 1 1 1 1 1 1 1 1 1 1 1
symmnumber: 1
zpe: 580947.0 jmol-1
zpe.correction: 0.221271 hartree
zpe.thermalcorrener: 0.235143 hartree
zpe.thermalcorrenthalpy: 0.236087 hartree
zpe.thermalcorrgfe: 0.180940 hartree
zpe.sumelectzpe: -765.178463 hartree
zpe.sumelectthermal: -765.164591 hartree
zpe.sumelectthermalent: -765.163647 hartree
zpe.sumelectthermalfe: -765.218795 hartree
dipole: 3.5854 3.3772 -0.0020
dipole: 4.9255
quadrupole: -99.4785 -90.7363 -100.4814
quadrupole: -19.9384 0.0074 0.0059
quadrupole: -2.5797 6.1624 -3.5826 -19.9384 0.0074 0.0059
hfenergy: -765.3997342 hartree
pointgroup: C01 [X(C14H12O3)]
dipole: 1.3938458 -1.3462869 0.0007921 debye
polarizability: 249.4959958|-6.1033233|192.6428236|-0.0021738|-0.0073672|76.0048067 unknown
InChI: InChI=1S/C14H12O3/c1-7-6-10-4-5-11(15)17-14(10)12-8(2)9(3)16-13(7)12/h4-6H,1-3H3
charge 0 multiplicity 1
29 atoms
O  2.799175 -0.347301 -0.000147
O  -1.670502 1.172294 0.000258
O  -3.81774 2.025133 -0.000975
C  0.59807 0.337569 0.000017
C  1.465794 -0.789753 -0.000052
C  1.43334 1.531862 -0.000083
C  -0.792508 0.085772 0.000131
C  1.063139 -2.145682 -0.000015
C  -1.263613 -1.26093 0.000164
C  2.744718 1.087425 -0.000105
C  -0.329944 -2.346805 0.000051
C  0.969414 2.964039 -0.000082
C  2.067451 -3.281265 -0.000059
C  -2.695781 -1.459636 -0.000047
C  4.071416 1.778674 -0.0003
C  -3.575602 -0.39745 0.000112
C  -3.124054 0.98981 0.001307
H  -0.723432 -3.370612 -0.000015
H  0.342998 3.179455 0.883888
H  1.8232 3.662849 -0.000472
H  0.342364 3.17926 -0.883644
H  1.9427 -3.923314 0.891034
H  1.941388 -3.924407 -0.89017
H  3.099841 -2.897561 -0.001024
H  -3.082913 -2.485586 -0.000563
H  4.194592 2.421623 0.890235
H  4.88236 1.03252 0.00191
H  4.196278 2.418093 -0.893162
H  -4.658847 -0.540877 -0.000491
